2-Nitrofuran
- Formula: C4H3NO3
- Molecular weight: 113.0715
- IUPAC Standard InChIKey: FUBFWTUFPGFHOJ-UHFFFAOYSA-N
- CAS Registry Number: 609-39-2
- Chemical structure:

Gas phase thermochemistry data

Data compiled by: Hussein Y. Afeefy, Joel F. Liebman, and Stephen E. Stein
Quantity | Value | Units | Method | Reference | Comment |
---|---|---|---|---|---|
ΔfH°gas | -29. ± 3. | kJ/mol | Ccb | Balepin, Lebedev, et al., 1980 | see Balepin, Lebedev, et al., 1978 |

Condensed phase thermochemistry data

Data compiled by: Hussein Y. Afeefy, Joel F. Liebman, and Stephen E. Stein
Quantity | Value | Units | Method | Reference | Comment |
---|---|---|---|---|---|
ΔfH°solid | -104. ± 0.4 | kJ/mol | Ccb | Balepin, Lebedev, et al., 1980 | see Balepin, Lebedev, et al., 1978 |
Quantity | Value | Units | Method | Reference | Comment |
ΔcH°solid | -1899. ± 0.4 | kJ/mol | Ccb | Balepin, Lebedev, et al., 1980 | see Balepin, Lebedev, et al., 1978 |

Phase change data

Data compiled as indicated in comments:
BS - Robert L. Brown and Stephen E. Stein
ALS - Hussein Y. Afeefy, Joel F. Liebman, and Stephen E. Stein
Reduced pressure boiling point
Tboil (K) | Pressure (bar) | Reference | Comment |
---|---|---|---|
357.2 | 0.017 | Aldrich Chemical Company Inc., 1990 | BS |
Enthalpy of sublimation
ΔsubH (kJ/mol) | Temperature (K) | Method | Reference | Comment |
---|---|---|---|---|
75. ± 2. | 277. | V | Balepin, Lebedev, et al., 1980 | see Balepin, Lebedev, et al., 1978; ALS |

Gas phase ion energetics data

Data compiled as indicated in comments:
LLK - Sharon G. Lias, Rhoda D. Levin, and Sherif A. Kafafi
Ionization energy determinations
IE (eV) | Method | Reference | Comment |
---|---|---|---|
10.04 ± 0.05 | EI | Linda, Marino, et al., 1971 | LLK |
9.75 ± 0.05 | PE | Fringuelli, Marino, et al., 1976 | Vertical value; LLK |

References

Balepin, Lebedev, et al., 1980
Balepin, A.A.; Lebedev, V.P.; Kuznetsova, A.A.; Venter, K.K.; Trushule, M.A.; Lolya, D.O.; Lebedev, Yu.A.,
Thermochemical properties of α-nitro derivatives of furan,
Bull. Acad. Sci. USSR, Div. Chem. Sci., 1980, 601-604. [all data]
Balepin, Lebedev, et al., 1978
Balepin, A.A.; Lebedev, V.P.; Kuznetsova, A.A.; Venters, K.; Trusule, M.; Ignatovich, L.M.; Lebedev, Yu.A.,
Aromatic stabilizatio of furan derivatives,
Vses. Nauchn. Konf. Khim. Tekhnol. Furanovykh Soedin., [Tezisy Dokl.], 1978, 3, 57-58. [all data]
Aldrich Chemical Company Inc., 1990
Aldrich Chemical Company Inc.,
Catalog Handbook of Fine Chemicals, Aldrich Chemical Company, Inc., Milwaukee WI, 1990, 1. [all data]
Linda, Marino, et al., 1971
Linda, P.; Marino, G.; Pignataro, S.,
A comparison of sensitivities to substituent effects of five- membered heteroaromatic rings in gas phase ionization,
J. Chem. Soc. B, 1971, 1585. [all data]
Fringuelli, Marino, et al., 1976
Fringuelli, F.; Marino, G.; Taticchi, A.; Distefano, G.; Colonna, F.P.; Pignataro, S.,
Photoelectron spectra of the α-substituted derivatives of furan, thiophen, selenophen, and tellurophen. A comparative study of the molecular orbital energies,
J. Chem. Soc. Perkin Trans. 2, 1976, 276. [all data]