1,3-Butadiyne, 1-iodo-
- Formula: C4HI
- Molecular weight: 175.9552
- IUPAC Standard InChIKey: IUUUVWLBOCMKOY-UHFFFAOYSA-N
- CAS Registry Number: 6088-91-1
- Chemical structure:
View 3d structure (requires JavaScript / HTML 5) - Permanent link for this species. Use this link for bookmarking this species for future reference.

Phase change data

Data compiled by: Thermodynamics Research Center, NIST Boulder Laboratories, Chris Muzny director
Quantity | Value | Units | Method | Reference | Comment |
---|---|---|---|---|---|
Tboil | 344. | K | N/A | Grignard and Tcheoufaki, 1929 | Uncertainty assigned by TRC = 3. K |

Gas phase ion energetics data

Data compiled by: Sharon G. Lias, Rhoda D. Levin, and Sherif A. Kafafi
Ionization energy determinations
IE (eV) | Method | Reference |
---|---|---|
9.24 ± 0.02 | PE | Heilbronner, Hornung, et al., 1974 |

Vibrational and/or electronic energy levels

Data compiled by: Takehiko Shimanouchi
Symmetry: Cxν Symmetry Number σ = 1
Sym. | No | Approximate | Selected Freq. | Infrared | Raman | Comments | ||||
---|---|---|---|---|---|---|---|---|---|---|
Species | type of mode | Value | Rating | Value | Phase | Value | Phase | |||
σ+ | 1 | CH str | 3332 | C | 3332 VS | gas | ||||
σ+ | 2 | C≡C a-str | 2211 | C | 2211 S | gas | ||||
σ+ | 3 | C≡C s-str | 2060 | C | 2060 VW | gas | ||||
σ+ | 4 | C-C str | 1025 | D | 1025 VW | solid solid | ||||
σ+ | 5 | CI str | 362 | C | 362 M | gas | ||||
π | 6 | CH bend | 623 | B | 623 VS | gas | ||||
π | 7 | CCCC a-bend | 473 | B | 473 M | gas | ||||
π | 8 | CCCC s-bend | 357 | C | 357 W | gas | ||||
π | 9 | CCI bend | 110 | E | 110 | gas | OC(ν8+ν9,ν7+ν9) | |||
Source: Shimanouchi, 1972

References

Grignard and Tcheoufaki, 1929
Grignard, V.; Tcheoufaki,
The α-Diacetylenic Hydrocarbons,
C. R. Hebd. Seances Acad. Sci., 1929, 188, 357. [all data]
Heilbronner, Hornung, et al., 1974
Heilbronner, E.; Hornung, V.; Maier, J.P.; Kloster-Jensen, E.,
The photoelectron spectra of halodiacetylenes, dihalodiacetylenes, and halomethyldiacetylenes,
J. Am. Chem. Soc., 1974, 96, 4252. [all data]
Shimanouchi, 1972
Shimanouchi, T.,
Tables of Molecular Vibrational Frequencies Consolidated Volume II,
J. Phys. Chem. Ref. Data, 1972, 6, 3, 993-1102. [all data]