5-Methoxytryptamine
- Formula: C11H14N2O
- Molecular weight: 190.2417
- IUPAC Standard InChIKey: JTEJPPKMYBDEMY-UHFFFAOYSA-N
- CAS Registry Number: 608-07-1
- Chemical structure:
View 3d structure (requires JavaScript / HTML 5) - Other names: 1H-Indole-3-ethanamine, 5-methoxy-; Indole, 3-(2-aminoethyl)-5-methoxy-; Methoxytryptamine; 3-(2-Aminoethyl)-5-methoxyindole; 5MOT; Meksamin (free base); Mexamine; Mexamine base; Ethanamine,2-(5-methoxy-3-indolyl)-; 2-(5-Methoxyindol-3-yl)ethylamine; NSC 56422

Gas phase ion energetics data

Data compiled as indicated in comments:
LLK - Sharon G. Lias, Rhoda D. Levin, and Sherif A. Kafafi
Ionization energy determinations
IE (eV) | Method | Reference | Comment |
---|---|---|---|
7.68 ± 0.12 | PE | Domelsmith, Munchausen, et al., 1977 | Vertical value; LLK |

References

Domelsmith, Munchausen, et al., 1977
Domelsmith, L.N.; Munchausen, L.L.; Houk, K.N.,
Photoelectron spectra of psychotropic drugs. 1. Phenethylamines, tryptamines, and LSD,
J. Am. Chem. Soc., 1977, 99, 4311. [all data]