Methyl (2,2-dimethylpropyl) sulfide
- Formula: C6H14S
- Molecular weight: 118.240
- IUPAC Standard InChIKey: YUFAJXXIXSYTMS-UHFFFAOYSA-N
- CAS Registry Number: 6079-57-8
- Chemical structure:
View 3d structure (requires JavaScript / HTML 5) - Other names: Propane, 2,2-dimethyl-1-(methylthio)-

Gas phase ion energetics data

Data compiled by: Sharon G. Lias and Joel F. Liebman
Ionization energy determinations
IE (eV) | Method | Reference | Comment |
---|---|---|---|
8.46 ± 0.05 | PE | Block, Yencha, et al., 1988 | Vertical value |

Normal alkane RI, non-polar column, custom temperature program

Column type | Active phase | I | Reference | Comment |
---|---|---|---|---|
Capillary | Methyl Silicone | 823. | Zenkevich, 1999 | Program: not specified |

References

Block, Yencha, et al., 1988
Block, E.; Yencha, A.J.; Aslam, M.; Eswarakrishnan, V.; Luo, J.; Sano, A.,
Gas-phase determination of the geometric requirements of the silicon B-effect. Photoelectron and penning ionization electron spectroscopic study of silylthiiranes and -oxiranes. Synthesis and chemistry of trans-2,3-bis(trimethylsilyl)thiirane,
J. Am. Chem. Soc., 1988, 110, 4748. [all data]
Zenkevich, 1999
Zenkevich, I.G.,
Dependence of Gas Chromatographic Retention Indices on Dynamics Molecular Characteristics,
Zh. Fiz. Khim., 1999, 73, 5, 905-910. [all data]