1-Naphthalenamine, 2-nitro-
- Formula: C10H8N2O2
- Molecular weight: 188.1827
- IUPAC Standard InChIKey: SMAJHKXZBICXLS-UHFFFAOYSA-N
- CAS Registry Number: 607-23-8
- Chemical structure:
View 3d structure (requires JavaScript / HTML 5) - Permanent link for this species. Use this link for bookmarking this species for future reference.

Gas phase ion energetics data

Data compiled by: Sharon G. Lias, Rhoda D. Levin, and Sherif A. Kafafi
Ionization energy determinations
IE (eV) | Method | Reference |
---|---|---|
7.79 ± 0.02 | PI | Potapov, Kardash, et al., 1972 |

References

Potapov, Kardash, et al., 1972
Potapov, V.K.; Kardash, I.E.; Sorokin, V.V.; Sokolov, S.A.; Evlasheva, T.I.,
Photoionization of heteroaromatic compounds,
Khim. Vys. Energ., 1972, 6, 392. [all data]
Milliaresi and Ruchkina, 1970
Milliaresi, E.E.; Ruchkina, N.G.,
Doklady Akad. Nauk S.S.S.R., 1970, 190-195, 82. [all data]