Propyl-d1-formate
- Formula: C4H7DO2
- Molecular weight: 89.1113
- IUPAC Standard InChIKey: RMOUBSOVHSONPZ-WFVSFCRTSA-N
- CAS Registry Number: 60703-00-6
- Chemical structure:
View 3d structure (requires JavaScript / HTML 5) - Isotopologues:

Gas phase ion energetics data

Data compiled by: Henry M. Rosenstock, Keith Draxl, Bruce W. Steiner, and John T. Herron
Appearance energy determinations
Ion | AE (eV) | Other Products | Method | Reference | Comment |
---|---|---|---|---|---|
C3H7O+ | 11.22 | CDO | EI | Bernecker and Long, 1961 |

References

Bernecker and Long, 1961
Bernecker, R.R.; Long, F.,
Some organic positive ions and their parent radicals and molecules,
J. Phys. Chem., 1961, 65, 1565. [all data]