Naphthacene,1,4,5,6,7,10,11,12-octahydro-
- Formula: C18H20
- Molecular weight: 236.3514
- IUPAC Standard InChIKey: OYMAYQDKADWNDK-UHFFFAOYSA-N
- CAS Registry Number: 60700-47-2
- Chemical structure:
View 3d structure (requires JavaScript / HTML 5) - Permanent link for this species. Use this link for bookmarking this species for future reference.

Gas phase ion energetics data

Data compiled by: Sharon G. Lias, Rhoda D. Levin, and Sherif A. Kafafi
Ionization energy determinations
IE (eV) | Method | Reference | Comment |
---|---|---|---|
8.14 | PE | Heilbronner, Brogli, et al., 1976 | Vertical value |

References

Heilbronner, Brogli, et al., 1976
Heilbronner, E.; Brogli, F.; Vogel, E.,
Photoelectron spectroscopic assignment of symmetry to the ground state and first excited state of the 1,4-cyclohexadiene radical cation,
J. Electron Spectrosc. Relat. Phenom., 1976, 9, 227. [all data]