Phosphine imide, p,p,p-trimethyl-N-(trimethylsilyl)-

Gas phase ion energetics data

Data compiled by: Sharon G. Lias, Rhoda D. Levin, and Sherif A. Kafafi

Ionization energy determinations

IE (eV) Method Reference Comment
8.30PEStarzewski and Dieck, 1979Vertical value
8.30PEStarzewski, Dieck, et al., 1974Vertical value

References

Starzewski and Dieck, 1979
Starzewski, K.A.O.; Dieck, H.t., Electronic structure and reactivity. 8. Iminophosphoranes- simple ylide analogues? An investigation of quantitative and sphenomenological differences, Inorg. Chem., 1979, 18, 3307. [all data]

Starzewski, Dieck, et al., 1974
Starzewski, K.A.O.; Dieck, H.T.; Bock, H., Photoelectron spectra molecular properties. XXIII. Photoelectron spectra of silicon-substituted ylidic systems, J. Organomet. Chem., 1974, 65, 311. [all data]