1H-Indene-1,3(2H)-dione

Gas phase ion energetics data

Data compiled as indicated in comments:
B - John E. Bartmess
LLK - Sharon G. Lias, Rhoda D. Levin, and Sherif A. Kafafi

Ionization energy determinations

IE (eV) Method Reference Comment
9.43 ± 0.05PEGalasso, Colonna, et al., 1977Vertical value; LLK

De-protonation reactions

C9H5O2- + Hydrogen cation = 1H-Indene-1,3(2H)-dione

By formula: C9H5O2- + H+ = C9H6O2

Quantity Value Units Method Reference Comment
Δr1400. ± 8.8kJ/molG+TSMishima, Matsuoka, et al., 2004gas phase; Calc: keto form of acid more stable.; B
Quantity Value Units Method Reference Comment
Δr1372. ± 8.4kJ/molIMREMishima, Matsuoka, et al., 2004gas phase; Calc: keto form of acid more stable.; B

Van Den Dool and Kratz RI, non-polar column, temperature ramp

View large format table.

Column type Active phase I Reference Comment
CapillaryDB-51358.Rostad and Pereira, 198630. m/0.26 mm/0.25 μm, He, 50. C @ 4. min, 6. K/min, 300. C @ 20. min

Lee's RI, non-polar column, temperature ramp

View large format table.

Column type Active phase I Reference Comment
CapillarySPB-5232.6Knobloch and Engewald, 199340. C @ 2. min, 4. K/min; Column length: 30. m; Column diameter: 0.25 mm; Tend: 300. C
CapillaryDB-5232.00Rostad and Pereira, 198630. m/0.26 mm/0.25 μm, He, 50. C @ 4. min, 6. K/min, 300. C @ 20. min

Reaction thermochemistry data

Data compiled by: John E. Bartmess

Individual Reactions

C9H5O2- + Hydrogen cation = 1H-Indene-1,3(2H)-dione

By formula: C9H5O2- + H+ = C9H6O2

Quantity Value Units Method Reference Comment
Δr1400. ± 8.8kJ/molG+TSMishima, Matsuoka, et al., 2004gas phase; Calc: keto form of acid more stable.
Quantity Value Units Method Reference Comment
Δr1372. ± 8.4kJ/molIMREMishima, Matsuoka, et al., 2004gas phase; Calc: keto form of acid more stable.

References

Galasso, Colonna, et al., 1977
Galasso, V.; Colonna, F.P.; Distefano, G., Photoelectron spectra of 1,2-indandione, 1,3-indandione and heterocyclic analogues, J. Electron Spectrosc. Relat. Phenom., 1977, 10, 227. [all data]

Mishima, Matsuoka, et al., 2004
Mishima, M.; Matsuoka, M.; Lei, Y.X.; Rappoport, Z., Gas-phase acidities of disubstituted methanes and of enols of carboxamides substituted by electron-withdrawing groups, J. Org. Chem., 2004, 69, 18, 5947-5965, https://doi.org/10.1021/jo040196b . [all data]