9,10-Anthracenedione, 2-hydroxy-
- Formula: C14H8O3
- Molecular weight: 224.2115
- IUPAC Standard InChIKey: GCDBEYOJCZLKMC-UHFFFAOYSA-N
- CAS Registry Number: 605-32-3
- Chemical structure:

Condensed phase thermochemistry data

Data compiled by: Hussein Y. Afeefy, Joel F. Liebman, and Stephen E. Stein
Quantity | Value | Units | Method | Reference | Comment |
---|---|---|---|---|---|
ΔcH°solid | -6199.4 | kJ/mol | Ccb | Swietoslawski and Starczedska, 1925 | Corresponding ΔfHºsolid = -453.1 kJ/mol (simple calculation by NIST; no Washburn corrections) |

Phase change data

Data compiled by: William E. Acree, Jr., James S. Chickos
Enthalpy of sublimation
ΔsubH (kJ/mol) | Temperature (K) | Method | Reference | Comment |
---|---|---|---|---|
153.1 | 408. | A | Stephenson and Malanowski, 1987 | Based on data from 393. to 453. K. |

Gas phase ion energetics data

Data compiled by: Sharon G. Lias, Rhoda D. Levin, and Sherif A. Kafafi
Ionization energy determinations
IE (eV) | Method | Reference |
---|---|---|
8.70 ± 0.03 | PI | Potapov and Sorokin, 1971 |

References

Swietoslawski and Starczedska, 1925
Swietoslawski, W.; Starczedska, H.,
Correction des donnees thermochimiques de M.A. Valeur,
J. Chem. Phys., 1925, 22, 399-401. [all data]
Stephenson and Malanowski, 1987
Stephenson, Richard M.; Malanowski, Stanislaw,
Handbook of the Thermodynamics of Organic Compounds, 1987, https://doi.org/10.1007/978-94-009-3173-2
. [all data]
Potapov and Sorokin, 1971
Potapov, V.K.; Sorokin, V.V.,
Photoionization and ion-molecule reactions in quinones and alcohols,
High Energy Chem., 1971, 5, 435, In original 487. [all data]
Land (editor), 1965
Land (editor), L.,
Absorption Spectra in the Ultraviolet and Visible Region, 1965, 5, 263. [all data]