3-bromo-4,4-dimethyloxazolidin-2-one
- Formula: C5H8BrNO2
- Molecular weight: 194.027
- IUPAC Standard InChIKey: UGTLNHLTOZDVCT-UHFFFAOYSA-N
- CAS Registry Number: 60491-95-4
- Chemical structure:
View 3d structure (requires JavaScript / HTML 5) - Other names: 3-Bromo-4,4-dimethyl-2-oxazolidinone

Gas phase ion energetics data

Data compiled by: Sharon G. Lias, Rhoda D. Levin, and Sherif A. Kafafi
Ionization energy determinations
IE (eV) | Method | Reference | Comment |
---|---|---|---|
9.45 | PE | Gerson, Worley, et al., 1978 | Vertical value |

References

Gerson, Worley, et al., 1978
Gerson, S.H.; Worley, S.D.; Bodor, N.; Kaminski, J.J.; Flechtner, T.W.,
The photoelectron spectra of some heterocyclic compounds which contain N, O, Cl, and Br,
J. Electron Spectrosc. Relat. Phenom., 1978, 13, 421. [all data]