Phenanthrene, 9,10-dimethyl-
- Formula: C16H14
- Molecular weight: 206.2824
- IUPAC Standard InChIKey: JUEORGSHIXFSSI-UHFFFAOYSA-N
- CAS Registry Number: 604-83-1
- Chemical structure:
View 3d structure (requires JavaScript / HTML 5) - Other names: 9,10-Dimethylphenanthrene; 9,10-Phenanthraquinodimethane

Gas phase thermochemistry data

Data compiled by: Hussein Y. Afeefy, Joel F. Liebman, and Stephen E. Stein
Quantity | Value | Units | Method | Reference | Comment |
---|---|---|---|---|---|
ΔfH°gas | 167. | kJ/mol | Ccb | Geiseler, Quitzsch, et al., 1966 |

Condensed phase thermochemistry data

Data compiled by: Hussein Y. Afeefy, Joel F. Liebman, and Stephen E. Stein
Quantity | Value | Units | Method | Reference | Comment |
---|---|---|---|---|---|
ΔcH°solid | -8344.6 | kJ/mol | Ccb | Geiseler, Quitzsch, et al., 1966 | Corresponding ΔfHºsolid = 47.7 kJ/mol (simple calculation by NIST; no Washburn corrections) |

Phase change data

Data compiled by: Hussein Y. Afeefy, Joel F. Liebman, and Stephen E. Stein
Quantity | Value | Units | Method | Reference | Comment |
---|---|---|---|---|---|
ΔsubH° | 119.5 | kJ/mol | V | Geiseler, Quitzsch, et al., 1966 |

Gas phase ion energetics data

Data compiled as indicated in comments:
RDSH - Henry M. Rosenstock, Keith Draxl, Bruce W. Steiner, and John T. Herron
Ionization energy determinations
IE (eV) | Method | Reference | Comment |
---|---|---|---|
8.01 ± 0.05 | EI | Nounou, 1966 | RDSH |
Appearance energy determinations
Ion | AE (eV) | Other Products | Method | Reference | Comment |
---|---|---|---|---|---|
C15H10+ | 18.0 ± 0.1 | ? | EI | Nounou, 1966 | RDSH |
C15H11+ | 12.0 ± 0.1 | CH3 | EI | Nounou, 1966 | RDSH |

Lee's RI, non-polar column, temperature ramp

Column type | Active phase | I | Reference | Comment |
---|---|---|---|---|
Capillary | CP Sil 8 CB | 348.52 | Garrigues, Parlanti, et al., 1987 | 50. m/0.22 mm/0.13 μm, H2, 120. C @ 2. min, 3. K/min; Tend: 270. C |

Lee's RI, non-polar column, custom temperature program

Column type | Active phase | I | Reference | Comment |
---|---|---|---|---|
Capillary | DB-5 | 347.9 | Zamperlini, Silva, et al., 1997 | 30. m/0.25 mm/0.25 μm, He; Program: 90C (1min) => 10C/min => 120C => 4C/min => 310C (20min) |

References

Geiseler, Quitzsch, et al., 1966
Geiseler, V.G.; Quitzsch, K.; Rauh, H.J.; Schaffernicht, H.; Walther, H.J.,
Bildungsenthalpien und Mesomerieenergien von π-Bindungssystemen 1. Mitteilung: Bildungsenthalpien und Mesomerieenergien einiger mehrkerniger Aromaten und verschiedener Pseudoazulene,
Ber. Bunsen-Ges. Phys. Chem., 1966, 70, 551-556. [all data]
Nounou, 1966
Nounou, P.,
Etude des composes aromatiques par spectrometrie de masse. I. Mesure des potentials d'ionisation et d'apparition par la methode du potential retardateur et interpretation des courbes d'ionisation differentielle,
J. Chim. Phys., 1966, 63, 994. [all data]
Garrigues, Parlanti, et al., 1987
Garrigues, P.; Parlanti, E.; Radke, M.; Bellocq, J.; Willsch, H.; Ewald, M.,
Identification of alkylphenanthrenes in shale oil and coal by liquid and capillary gas chromatography and high-resolution spectrofluorimetry (Shpol'skii effect),
J. Chromatogr., 1987, 395, 217-228, https://doi.org/10.1016/S0021-9673(01)94112-3
. [all data]
Zamperlini, Silva, et al., 1997
Zamperlini, G.C.M.; Silva, M.R.S.; Vilegas, W.,
Identification of polycyclic aromatic hydrocarbons in sugar cane soot by gas chromatography-mass spectrometry,
Chromatographia, 1997, 46, 11/12, 655-663, https://doi.org/10.1007/BF02490527
. [all data]