Benzenemethanamine,2-hydroxy-N-methyl-
- Formula: C8H11NO
- Molecular weight: 137.1790
- IUPAC Standard InChIKey: PVFSNBPKQDSTPP-UHFFFAOYSA-N
- CAS Registry Number: 60399-02-2
- Chemical structure:
View 3d structure (requires JavaScript / HTML 5) - Permanent link for this species. Use this link for bookmarking this species for future reference.

Gas phase ion energetics data

Data compiled by: Sharon G. Lias, Rhoda D. Levin, and Sherif A. Kafafi
Ionization energy determinations
IE (eV) | Method | Reference | Comment |
---|---|---|---|
8.18 | PE | Fragala, Millefiori, et al., 1980 | Vertical value |

References

Fragala, Millefiori, et al., 1980
Fragala, I.; Millefiori, S.; Recca, A.,
Gas phase ultraviolet photoelectron spectra of aromatic azomethine compounds,
J. Chem. Res. Synop., 1980, 1, 28. [all data]