Molybdenum monofluoride
- Formula: FMo
- Molecular weight: 114.96
- CAS Registry Number: 60388-18-3

Gas phase thermochemistry data

Quantity | Value | Units | Method | Reference | Comment |
---|---|---|---|---|---|
ΔfH°gas | 282.84 | kJ/mol | Review | Chase, 1998 | Data last reviewed in December, 1978 |
Quantity | Value | Units | Method | Reference | Comment |
S°gas,1 bar | 246.39 | J/mol*K | Review | Chase, 1998 | Data last reviewed in December, 1978 |
Gas Phase Heat Capacity (Shomate Equation)
Cp° = A + B*t + C*t2 + D*t3 +
E/t2
H° − H°298.15= A*t + B*t2/2 +
C*t3/3 + D*t4/4 − E/t + F − H
S° = A*ln(t) + B*t + C*t2/2 + D*t3/3 −
E/(2*t2) + G
Cp = heat capacity (J/mol*K)
H° = standard enthalpy (kJ/mol)
S° = standard entropy (J/mol*K)
t = temperature (K) / 1000.
View plot Requires a JavaScript / HTML 5 canvas capable browser.
Temperature (K) | 298. to 2400. | 2400. to 6000. |
---|---|---|
A | 33.31200 | -98.44910 |
B | 8.144575 | 55.43758 |
C | -5.511709 | -5.327947 |
D | 1.357754 | 0.060214 |
E | -0.235125 | 203.5746 |
F | 271.8014 | 546.6773 |
G | 283.1899 | 308.1893 |
H | 282.8384 | 282.8384 |
Reference | Chase, 1998 | Chase, 1998 |
Comment | Data last reviewed in December, 1978 | Data last reviewed in December, 1978 |

Gas phase ion energetics data

Data compiled as indicated in comments:
LLK - Sharon G. Lias, Rhoda D. Levin, and Sherif A. Kafafi
Ionization energy determinations
IE (eV) | Method | Reference | Comment |
---|---|---|---|
8.0 ± 0.3 | EI | Hildenbrand, 1976 | LLK |

References

Chase, 1998
Chase, M.W., Jr.,
NIST-JANAF Themochemical Tables, Fourth Edition,
J. Phys. Chem. Ref. Data, Monograph 9, 1998, 1-1951. [all data]
Hildenbrand, 1976
Hildenbrand, D.L.,
Thermochemical studies of the gaseous lower valent fluorides of molybdenum,
J. Chem. Phys., 1976, 65, 614. [all data]