Arsine, dimethyl(trifluorosilyl)-
- Formula: C2H6AsF3Si
- Molecular weight: 190.0713
- IUPAC Standard InChIKey: CULOBSMAOTUFIR-UHFFFAOYSA-N
- CAS Registry Number: 60387-29-3
- Chemical structure:
View 3d structure (requires JavaScript / HTML 5) - Permanent link for this species. Use this link for bookmarking this species for future reference.

Gas phase ion energetics data

Data compiled by: Sharon G. Lias, Rhoda D. Levin, and Sherif A. Kafafi
Ionization energy determinations
IE (eV) | Method | Reference | Comment |
---|---|---|---|
9.4 ± 0.05 | PE | Demuth, 1977 | Vertical value |

References

Demuth, 1977
Demuth, R.,
Photoelektronenspektren von einigen Trihalogensilylphosphanen und -arsanen X3SiER2 (X = F, Cl; E = N, P, As; R = H, CH3),
Z. Naturforsch. B:, 1977, 32, 1252. [all data]