Stibine, triphenyl-
- Formula: C18H15Sb
- Molecular weight: 353.072
- IUPAC Standard InChIKey: HVYVMSPIJIWUNA-UHFFFAOYSA-N
- CAS Registry Number: 603-36-1
- Chemical structure:
View 3d structure (requires JavaScript / HTML 5) - Other names: Triphenylantimony; Triphenylstibine; Trifenylstibin; Triphenylstibane

Gas phase thermochemistry data

Data compiled by: José A. Martinho Simões
Quantity | Value | Units | Method | Reference | Comment |
---|---|---|---|---|---|
ΔfH°gas | 435. ± 19. | kJ/mol | Review | Martinho Simões |

Condensed phase thermochemistry data

Data compiled by: José A. Martinho Simões
Quantity | Value | Units | Method | Reference | Comment |
---|---|---|---|---|---|
ΔfH°solid | 329. ± 17. | kJ/mol | Review | Martinho Simões | |
Quantity | Value | Units | Method | Reference | Comment |
ΔcH°solid | -10010. ± 17. | kJ/mol | CC-SB | Birr, 1960 | Please also see Pedley and Rylance, 1977 and Cox and Pilcher, 1970. |

Phase change data

Data compiled as indicated in comments:
TRC - Thermodynamics Research Center, NIST Boulder Laboratories, Chris Muzny director
AC - William E. Acree, Jr., James S. Chickos
MS - José A. Martinho Simões
Quantity | Value | Units | Method | Reference | Comment |
---|---|---|---|---|---|
Tfus | 328.2 | K | N/A | Forward, Bowden, et al., 1949 | Uncertainty assigned by TRC = 0.5 K; TRC |
Tfus | 325.15 | K | N/A | Smith and Andrews, 1931 | Uncertainty assigned by TRC = 1.5 K; with Hg thermometer; TRC |
Tfus | 321.15 | K | N/A | Smith and Andrews, 1931 | Uncertainty assigned by TRC = 1.5 K; with thermocouple; TRC |
Quantity | Value | Units | Method | Reference | Comment |
ΔsubH° | 106.3 ± 8.4 | kJ/mol | N/A | Pilcher and Skinner, 1983 | See also Birr, 1960, 2.; AC |
ΔsubH° | 106.3 ± 8.4 | kJ/mol | CC-SB | Skinner H.A., 1964 | Please also see Forward, Bowden, et al., 1949, 2.; MS |
Enthalpy of vaporization
ΔvapH (kJ/mol) | Temperature (K) | Method | Reference | Comment |
---|---|---|---|---|
83.3 | 518. | A | Stephenson and Malanowski, 1987 | Based on data from 503. to 553. K. See also Forward, Bowden, et al., 1949, 3.; AC |

Gas phase ion energetics data

Data evaluated as indicated in comments:
HL - Edward P. Hunter and Sharon G. Lias
Data compiled as indicated in comments:
LLK - Sharon G. Lias, Rhoda D. Levin, and Sherif A. Kafafi
RDSH - Henry M. Rosenstock, Keith Draxl, Bruce W. Steiner, and John T. Herron
Quantity | Value | Units | Method | Reference | Comment |
---|---|---|---|---|---|
Proton affinity (review) | 845.5 | kJ/mol | N/A | Hunter and Lias, 1998 | HL |
Quantity | Value | Units | Method | Reference | Comment |
Gas basicity | 813.1 | kJ/mol | N/A | Hunter and Lias, 1998 | HL |
Ionization energy determinations
IE (eV) | Method | Reference | Comment |
---|---|---|---|
7.26 ± 0.05 | PI | Potapov, Rodionov, et al., 1974 | LLK |
7.80 ± 0.01 | PE | Debies and Rabalais, 1974 | LLK |
7.3 ± 0.1 | PI | Vilesov and Zaitsev, 1964 | RDSH |
8.08 ± 0.05 | PE | Distefano, Pignataro, et al., 1975 | Vertical value; LLK |
Appearance energy determinations
Ion | AE (eV) | Other Products | Method | Reference | Comment |
---|---|---|---|---|---|
C6H5Sb+ | 8.7 ± 0.1 | ? | PI | Potapov, Rodionov, et al., 1974 | LLK |
C12H10Sb+ | 9.0 ± 0.1 | ? | PI | Potapov, Rodionov, et al., 1974 | LLK |

References

Martinho Simões
Martinho Simões, J.A.,
Private communication (see http://webbook.nist.gov/chemistry/om/). [all data]
Birr, 1960
Birr, K.-H.,
Z. Anorg. Allg. Chem., 1960, 306, 21. [all data]
Pedley and Rylance, 1977
Pedley, J.B.; Rylance, J.,
Computer Analysed Thermochemical Data: Organic and Organometallic Compounds, University of Sussex, Brigton, 1977. [all data]
Cox and Pilcher, 1970
Cox, J.D.; Pilcher, G.,
Thermochemistry of Organic and Organometallic Compounds
in Academic Press, New York, 1970. [all data]
Forward, Bowden, et al., 1949
Forward, M.V.; Bowden, S.T.; Jones, W.J.,
Physical Properties of Triphenyl Compounds of Group VB Elements,
J. Chem. Soc., 1949, 1949, 121-6. [all data]
Smith and Andrews, 1931
Smith, R.H.; Andrews, D.H.,
Thermal Energy Studies II. Phenyl Derivatives of Metals,
J. Am. Chem. Soc., 1931, 53, 3661-7. [all data]
Pilcher and Skinner, 1983
Pilcher, G.; Skinner, H.A.,
Thermochemistry of organometallic compounds, 1983, 43-90, https://doi.org/10.1002/9780470771686.ch2
. [all data]
Birr, 1960, 2
Birr, Karl-Heinz,
Bildungsw«65533»rmen von Triphenylphosphin und Triphenylstibin,
Z. Anorg. Allg. Chem., 1960, 306, 1-2, 21-24, https://doi.org/10.1002/zaac.19603060104
. [all data]
Skinner H.A., 1964
Skinner H.A.,
In Advances in Organometallic Chemistry; Vol. 2, Academic Press, New York, 1964. [all data]
Forward, Bowden, et al., 1949, 2
Forward, M.V.; Bowden, S.T.; Jones, W.J.,
J. Chem. Soc., 1949, S121.. [all data]
Stephenson and Malanowski, 1987
Stephenson, Richard M.; Malanowski, Stanislaw,
Handbook of the Thermodynamics of Organic Compounds, 1987, https://doi.org/10.1007/978-94-009-3173-2
. [all data]
Forward, Bowden, et al., 1949, 3
Forward, M.V.; Bowden, S.T.; Jones, W.J.,
S 26. Physical properties of triphenyl compounds of group V B elements,
J. Chem. Soc., 1949, S121, https://doi.org/10.1039/jr949000s121
. [all data]
Hunter and Lias, 1998
Hunter, E.P.; Lias, S.G.,
Evaluated Gas Phase Basicities and Proton Affinities of Molecules: An Update,
J. Phys. Chem. Ref. Data, 1998, 27, 3, 413-656, https://doi.org/10.1063/1.556018
. [all data]
Potapov, Rodionov, et al., 1974
Potapov, V.K.; Rodionov, A.N.; Evlasheva, T.I.; Rogozhin, K.L.,
Photoionization of triphenyl derivatives of elements in group VB of the periodic table,
High Energy Chem., 1974, 8, 486, In original 559. [all data]
Debies and Rabalais, 1974
Debies, T.P.; Rabalais, J.W.,
Photoelectron spectra of substituted benzenes. III. Bonding with Group V substituents,
Inorg. Chem., 1974, 13, 308. [all data]
Vilesov and Zaitsev, 1964
Vilesov, F.I.; Zaitsev, V.M.,
Photoionization of phenyl derivatives of group 5 elements,
Dokl. Akad. Nauk SSSR, 1964, 154, 886, In original 117. [all data]
Distefano, Pignataro, et al., 1975
Distefano, G.; Pignataro, S.; Szepes, L.; Borossay, J.,
Photoelectron spectroscopy study of the triphenyl derivatives of the group V elements,
J. Organomet. Chem., 1975, 102, 313. [all data]