Bismuthine, triphenyl-
- Formula: C18H15Bi
- Molecular weight: 440.2921
- IUPAC Standard InChIKey: ZHXAZZQXWJJBHA-UHFFFAOYSA-N
- CAS Registry Number: 603-33-8
- Chemical structure:
View 3d structure (requires JavaScript / HTML 5) - Other names: Bismuth triphenyl; Triphenylbismuth; Triphenylbismuthine; (C6H5)3Bi; Aerotex; Trifenylbismutin

Gas phase thermochemistry data

Data compiled by: José A. Martinho Simões
Quantity | Value | Units | Method | Reference | Comment |
---|---|---|---|---|---|
ΔfH°gas | 580. ± 19. | kJ/mol | Review | Martinho Simões | |
ΔfH°gas | 601. ± 10. | kJ/mol | Review | Martinho Simões | Selected data |
ΔfH°gas | 569. ± 12. | kJ/mol | Review | Martinho Simões |

Condensed phase thermochemistry data

Data compiled as indicated in comments:
MS - José A. Martinho Simões
DH - Eugene S. Domalski and Elizabeth D. Hearing
Quantity | Value | Units | Method | Reference | Comment |
---|---|---|---|---|---|
ΔfH°solid | 469. ± 17. | kJ/mol | Review | Martinho Simões | MS |
ΔfH°solid | 489.6 ± 5.6 | kJ/mol | Review | Martinho Simões | Selected data; MS |
ΔfH°solid | 457.8 ± 7.9 | kJ/mol | Review | Martinho Simões | MS |
Quantity | Value | Units | Method | Reference | Comment |
ΔcH°solid | -10003.5 ± 5.0 | kJ/mol | CC-RB | Steele, 1979 | MS |
ΔcH°solid | -9971.7 ± 7.5 | kJ/mol | CC-RB | Birr, 1961 | MS |
ΔcH°solid | -9983. ± 17. | kJ/mol | CC-SB | Birr, 1960 | Please also see Pedley and Rylance, 1977 and Cox and Pilcher, 1970.; MS |
Constant pressure heat capacity of solid
Cp,solid (J/mol*K) | Temperature (K) | Reference | Comment |
---|---|---|---|
330.2 | 298.15 | Steele, 1979, 2 | DH |
328.4 | 298.5 | Smith and Andrews, 1931 | T = 102 to 323 K.; DH |

Phase change data

Data compiled as indicated in comments:
TRC - Thermodynamics Research Center, NIST Boulder Laboratories, Chris Muzny director
AC - William E. Acree, Jr., James S. Chickos
MS - José A. Martinho Simões
Quantity | Value | Units | Method | Reference | Comment |
---|---|---|---|---|---|
Tfus | 351.5 | K | N/A | Forward, Bowden, et al., 1949 | Uncertainty assigned by TRC = 0.5 K; TRC |
Tfus | 350.15 | K | N/A | Smith and Andrews, 1931, 2 | Uncertainty assigned by TRC = 1. K; with Hg thermometer; TRC |
Tfus | 346.65 | K | N/A | Smith and Andrews, 1931, 2 | Uncertainty assigned by TRC = 1. K; with thermocouple; TRC |
Quantity | Value | Units | Method | Reference | Comment |
ΔsubH° | 110.9 ± 8.4 | kJ/mol | N/A | Pilcher and Skinner, 1983 | See also Steele, 1979, 2.; AC |
ΔsubH° | 110.9 ± 8.4 | kJ/mol | CC-SB | Skinner H.A., 1964 | MS |

Gas phase ion energetics data

Data compiled as indicated in comments:
LLK - Sharon G. Lias, Rhoda D. Levin, and Sherif A. Kafafi
RDSH - Henry M. Rosenstock, Keith Draxl, Bruce W. Steiner, and John T. Herron
Ionization energy determinations
IE (eV) | Method | Reference | Comment |
---|---|---|---|
7.45 ± 0.05 | PI | Potapov, Rodionov, et al., 1974 | LLK |
7.3 ± 0.1 | PI | Vilesov and Zaitsev, 1964 | RDSH |
Appearance energy determinations
Ion | AE (eV) | Other Products | Method | Reference | Comment |
---|---|---|---|---|---|
C6H5Bi+ | 7.8 ± 0.1 | ? | PI | Potapov, Rodionov, et al., 1974 | LLK |
C12H10Bi+ | 7.9 ± 0.1 | ? | PI | Potapov, Rodionov, et al., 1974 | LLK |

References

Martinho Simões
Martinho Simões, J.A.,
Private communication (see http://webbook.nist.gov/chemistry/om/). [all data]
Steele, 1979
Steele, W.V.,
J. Chem. Thermodyn., 1979, 11, 187. [all data]
Birr, 1961
Birr, K.-H.,
Z. Anorg. Allg. Chem., 1961, 311, 92. [all data]
Birr, 1960
Birr, K.-H.,
Z. Anorg. Allg. Chem., 1960, 306, 21. [all data]
Pedley and Rylance, 1977
Pedley, J.B.; Rylance, J.,
Computer Analysed Thermochemical Data: Organic and Organometallic Compounds, University of Sussex, Brigton, 1977. [all data]
Cox and Pilcher, 1970
Cox, J.D.; Pilcher, G.,
Thermochemistry of Organic and Organometallic Compounds
in Academic Press, New York, 1970. [all data]
Steele, 1979, 2
Steele, W.V.,
The standard enthalpies of formation of the triphenyl compounds of the group V elements. 2. Triphenylbismuth and the Ph-Bi mean bond-dissociation energy,
J. Chem. Thermodynam., 1979, 11, 187-192. [all data]
Smith and Andrews, 1931
Smith, R.H.; Andrews, D.H.,
Thermal energy studies. II. Phenyl derivatives of metals,
J. Am. Chem. Soc., 1931, 53, 3661-3667. [all data]
Forward, Bowden, et al., 1949
Forward, M.V.; Bowden, S.T.; Jones, W.J.,
Physical Properties of Triphenyl Compounds of Group VB Elements,
J. Chem. Soc., 1949, 1949, 121-6. [all data]
Smith and Andrews, 1931, 2
Smith, R.H.; Andrews, D.H.,
Thermal Energy Studies II. Phenyl Derivatives of Metals,
J. Am. Chem. Soc., 1931, 53, 3661-7. [all data]
Pilcher and Skinner, 1983
Pilcher, G.; Skinner, H.A.,
Thermochemistry of organometallic compounds, 1983, 43-90, https://doi.org/10.1002/9780470771686.ch2
. [all data]
Skinner H.A., 1964
Skinner H.A.,
In Advances in Organometallic Chemistry; Vol. 2, Academic Press, New York, 1964. [all data]
Potapov, Rodionov, et al., 1974
Potapov, V.K.; Rodionov, A.N.; Evlasheva, T.I.; Rogozhin, K.L.,
Photoionization of triphenyl derivatives of elements in group VB of the periodic table,
High Energy Chem., 1974, 8, 486, In original 559. [all data]
Vilesov and Zaitsev, 1964
Vilesov, F.I.; Zaitsev, V.M.,
Photoionization of phenyl derivatives of group 5 elements,
Dokl. Akad. Nauk SSSR, 1964, 154, 886, In original 117. [all data]