Arsine, triphenyl-
- Formula: C18H15As
- Molecular weight: 306.2333
- IUPAC Standard InChIKey: BPLUKJNHPBNVQL-UHFFFAOYSA-N
- CAS Registry Number: 603-32-7
- Chemical structure:

Condensed phase thermochemistry data

Data compiled by: Eugene S. Domalski and Elizabeth D. Hearing
Constant pressure heat capacity of solid
Cp,solid (cal/mol*K) | Temperature (K) | Reference | Comment |
---|---|---|---|
76.79 | 298.5 | Smith and Andrews, 1931 | T = 102 to 311 K. Value is unsmoothed experimental datum. |

Phase change data

Data compiled as indicated in comments:
TRC - Thermodynamics Research Center, NIST Boulder Laboratories, Chris Muzny director
AC - William E. Acree, Jr., James S. Chickos
Quantity | Value | Units | Method | Reference | Comment |
---|---|---|---|---|---|
Tfus | 334.0 | K | N/A | Forward, Bowden, et al., 1949 | Uncertainty assigned by TRC = 0.5 K; TRC |
Tfus | 332.3 | K | N/A | Smith and Andrews, 1931, 2 | Uncertainty assigned by TRC = 1. K; with Hg thermometer; TRC |
Tfus | 329.55 | K | N/A | Smith and Andrews, 1931, 2 | Uncertainty assigned by TRC = 1. K; with thermocouple; TRC |
Enthalpy of vaporization
ΔvapH (kcal/mol) | Temperature (K) | Method | Reference | Comment |
---|---|---|---|---|
18.1 | 508. | A | Stephenson and Malanowski, 1987 | Based on data from 493. to 563. K. See also Forward, Bowden, et al., 1949, 2.; AC |

Gas phase ion energetics data

Data evaluated as indicated in comments:
HL - Edward P. Hunter and Sharon G. Lias
Data compiled as indicated in comments:
LLK - Sharon G. Lias, Rhoda D. Levin, and Sherif A. Kafafi
RDSH - Henry M. Rosenstock, Keith Draxl, Bruce W. Steiner, and John T. Herron
Quantity | Value | Units | Method | Reference | Comment |
---|---|---|---|---|---|
Proton affinity (review) | 217.2 | kcal/mol | N/A | Hunter and Lias, 1998 | HL |
Quantity | Value | Units | Method | Reference | Comment |
Gas basicity | 209.5 | kcal/mol | N/A | Hunter and Lias, 1998 | HL |
Ionization energy determinations
IE (eV) | Method | Reference | Comment |
---|---|---|---|
7.32 ± 0.05 | PI | Potapov, Rodionov, et al., 1974 | LLK |
7.60 ± 0.01 | PE | Debies and Rabalais, 1974 | LLK |
7.34 ± 0.07 | PI | Vilesov and Zaitsev, 1964 | RDSH |
8.11 | PE | Daamen, Oskam, et al., 1980 | Vertical value; LLK |
8.03 ± 0.05 | PE | Distefano, Pignataro, et al., 1975 | Vertical value; LLK |
Appearance energy determinations
Ion | AE (eV) | Other Products | Method | Reference | Comment |
---|---|---|---|---|---|
C6H5As+ | 8.2 ± 0.1 | ? | PI | Potapov, Rodionov, et al., 1974 | LLK |
C12H10As+ | 9.4 ± 0.1 | ? | PI | Potapov, Rodionov, et al., 1974 | LLK |

Normal alkane RI, non-polar column, temperature ramp

Column type | Active phase | I | Reference | Comment |
---|---|---|---|---|
Capillary | DB-5MS | 2195. | Tørnes, Opstad, et al., 2006 | 30. m/0.25 mm/0.25 μm, He, 40. C @ 1. min, 10. K/min, 280. C @ 10. min |

References

Smith and Andrews, 1931
Smith, R.H.; Andrews, D.H.,
Thermal energy studies. II. Phenyl derivatives of metals,
J. Am. Chem. Soc., 1931, 53, 3661-3667. [all data]
Forward, Bowden, et al., 1949
Forward, M.V.; Bowden, S.T.; Jones, W.J.,
Physical Properties of Triphenyl Compounds of Group VB Elements,
J. Chem. Soc., 1949, 1949, 121-6. [all data]
Smith and Andrews, 1931, 2
Smith, R.H.; Andrews, D.H.,
Thermal Energy Studies II. Phenyl Derivatives of Metals,
J. Am. Chem. Soc., 1931, 53, 3661-7. [all data]
Stephenson and Malanowski, 1987
Stephenson, Richard M.; Malanowski, Stanislaw,
Handbook of the Thermodynamics of Organic Compounds, 1987, https://doi.org/10.1007/978-94-009-3173-2
. [all data]
Forward, Bowden, et al., 1949, 2
Forward, M.V.; Bowden, S.T.; Jones, W.J.,
S 26. Physical properties of triphenyl compounds of group V B elements,
J. Chem. Soc., 1949, S121, https://doi.org/10.1039/jr949000s121
. [all data]
Hunter and Lias, 1998
Hunter, E.P.; Lias, S.G.,
Evaluated Gas Phase Basicities and Proton Affinities of Molecules: An Update,
J. Phys. Chem. Ref. Data, 1998, 27, 3, 413-656, https://doi.org/10.1063/1.556018
. [all data]
Potapov, Rodionov, et al., 1974
Potapov, V.K.; Rodionov, A.N.; Evlasheva, T.I.; Rogozhin, K.L.,
Photoionization of triphenyl derivatives of elements in group VB of the periodic table,
High Energy Chem., 1974, 8, 486, In original 559. [all data]
Debies and Rabalais, 1974
Debies, T.P.; Rabalais, J.W.,
Photoelectron spectra of substituted benzenes. III. Bonding with Group V substituents,
Inorg. Chem., 1974, 13, 308. [all data]
Vilesov and Zaitsev, 1964
Vilesov, F.I.; Zaitsev, V.M.,
Photoionization of phenyl derivatives of group 5 elements,
Dokl. Akad. Nauk SSSR, 1964, 154, 886, In original 117. [all data]
Daamen, Oskam, et al., 1980
Daamen, H.; Oskam, A.; Stufkens, D.J.,
U.V. photoelectron (He I and He II) studies of M(CO)5PR3 (M = Cr, W and R = C6H11, C6H5, O-i-C3H7, OC6H5) and W(CO)5As(C6H5)3,
Inorg. Chim. Acta, 1980, 38, 71. [all data]
Distefano, Pignataro, et al., 1975
Distefano, G.; Pignataro, S.; Szepes, L.; Borossay, J.,
Photoelectron spectroscopy study of the triphenyl derivatives of the group V elements,
J. Organomet. Chem., 1975, 102, 313. [all data]
Tørnes, Opstad, et al., 2006
Tørnes, J.A.; Opstad, A.M.; Johnsen, B.A.,
Determination of organoarsenic warfare agents in sediment samples from Skagerrak by gas chromatography-mass spectrometry,
Sci. Total Environ., 2006, 356, 1-3, 235-246, https://doi.org/10.1016/j.scitotenv.2005.03.031
. [all data]