Stannane, tetrakis(1-methylpropyl)-
- Formula: C16H36Sn
- Molecular weight: 347.167
- IUPAC Standard InChIKey: LEOARMIFBDRUPR-UHFFFAOYSA-N
- CAS Registry Number: 6031-41-0
- Chemical structure:
View 3d structure (requires JavaScript / HTML 5) - Permanent link for this species. Use this link for bookmarking this species for future reference.

Gas phase ion energetics data

Data compiled by: Sharon G. Lias, Rhoda D. Levin, and Sherif A. Kafafi
Ionization energy determinations
IE (eV) | Method | Reference | Comment |
---|---|---|---|
8.45 | PE | Kochi, 1980 | Vertical value |

References

Kochi, 1980
Kochi, J.K.,
The role of electron transfer and charge transfer in organometallic chemistry,
Pure Appl. Chem., 1980, 52, 571. [all data]