Benzoic acid, pentafluoro-
- Formula: C7HF5O2
- Molecular weight: 212.0737
- IUPAC Standard InChIKey: YZERDTREOUSUHF-UHFFFAOYSA-N
- CAS Registry Number: 602-94-8
- Chemical structure:
View 3d structure (requires JavaScript / HTML 5) - Other names: Pentafluorobenzoic acid; Perfluorobenzoic acid; 2,3,4,5,6-Pentafluorobenzoic acid

Condensed phase thermochemistry data

Data compiled by: Hussein Y. Afeefy, Joel F. Liebman, and Stephen E. Stein
Quantity | Value | Units | Method | Reference | Comment |
---|---|---|---|---|---|
ΔfH°solid | -296.34 ± 0.24 | kcal/mol | Ccr | Cox, Gundry, et al., 1969 | |
Quantity | Value | Units | Method | Reference | Comment |
ΔcH°solid | -610.13 ± 0.24 | kcal/mol | Ccr | Cox, Gundry, et al., 1969 |

Phase change data

Data compiled as indicated in comments:
BS - Robert L. Brown and Stephen E. Stein
ALS - Hussein Y. Afeefy, Joel F. Liebman, and Stephen E. Stein
AC - William E. Acree, Jr., James S. Chickos
Quantity | Value | Units | Method | Reference | Comment |
---|---|---|---|---|---|
Tboil | 493. | K | N/A | PCR Inc., 1990 | BS |
Tboil | 493.2 | K | N/A | Weast and Grasselli, 1989 | BS |
Quantity | Value | Units | Method | Reference | Comment |
ΔsubH° | 21.9 ± 0.1 | kcal/mol | V | Cox, Gundry, et al., 1969 | ALS |
Enthalpy of sublimation
ΔsubH (kcal/mol) | Temperature (K) | Method | Reference | Comment |
---|---|---|---|---|
21.9 ± 1.0 | 335. to 359. | GS | Cox, Gundry, et al., 1969 | See also Cox and Pilcher, 1970.; AC |

Reaction thermochemistry data

Data compiled by: John E. Bartmess
Individual Reactions
C7F5O2- + =
By formula: C7F5O2- + H+ = C7HF5O2
Quantity | Value | Units | Method | Reference | Comment |
---|---|---|---|---|---|
ΔrH° | 323.6 ± 2.1 | kcal/mol | G+TS | Koppel, Taft, et al., 1994 | gas phase |
Quantity | Value | Units | Method | Reference | Comment |
ΔrG° | 316.6 ± 2.0 | kcal/mol | IMRE | Koppel, Taft, et al., 1994 | gas phase |

Gas phase ion energetics data

Data compiled as indicated in comments:
B - John E. Bartmess
LLK - Sharon G. Lias, Rhoda D. Levin, and Sherif A. Kafafi
Ionization energy determinations
IE (eV) | Method | Reference | Comment |
---|---|---|---|
9.2 | PE | Meeks, Wahlborg, et al., 1981 | LLK |
10.2 | PE | Meeks, Wahlborg, et al., 1981 | Vertical value; LLK |
De-protonation reactions
C7F5O2- + =
By formula: C7F5O2- + H+ = C7HF5O2
Quantity | Value | Units | Method | Reference | Comment |
---|---|---|---|---|---|
ΔrH° | 323.6 ± 2.1 | kcal/mol | G+TS | Koppel, Taft, et al., 1994 | gas phase; B |
Quantity | Value | Units | Method | Reference | Comment |
ΔrG° | 316.6 ± 2.0 | kcal/mol | IMRE | Koppel, Taft, et al., 1994 | gas phase; B |

Van Den Dool and Kratz RI, non-polar column, temperature ramp

Column type | Active phase | I | Reference | Comment |
---|---|---|---|---|
Capillary | VF-5MS | 1176. | Zheng, 2011 | 30. m/0.25 mm/0.25 μm, He; Tstart: 60. C; Tend: 270. C |

Gas phase thermochemistry data

Data compiled by: Hussein Y. Afeefy, Joel F. Liebman, and Stephen E. Stein

Quantity Value Units Method Reference Comment
Δfgas-1148.4 ± 1.0kJ/molCcrCox, Gundry, et al., 1969

References

Cox, Gundry, et al., 1969
Cox, J.D.; Gundry, H.A.; Harrop, D.; Head, A.J.,
Thermodynamic properties of fluorine compounds. 9. Enthalpies of formation of some compounds containing the pentafluorophenyl group,
J. Chem. Thermodyn., 1969, 1, 77-87. [all data]
PCR Inc., 1990
PCR Inc.,
Research Chemicals Catalog 1990-1991, PCR Inc., Gainesville, FL, 1990, 1. [all data]
Weast and Grasselli, 1989
CRC Handbook of Data on Organic Compounds, 2nd Editon, Weast,R.C and Grasselli, J.G., ed(s)., CRC Press, Inc., Boca Raton, FL, 1989, 1. [all data]
Cox and Pilcher, 1970
Cox, J.D.; Pilcher, G.,
Thermochemistry of Organic and Organometallic Compounds, Academic Press Inc., London, 1970, 643. [all data]
Koppel, Taft, et al., 1994
Koppel, I.A.; Taft, R.W.; Anvia, F.; Zhu, S.Z.; Hu, L.Q.; Sung, K.S.; Desmarteau, D.D.; Yagupolskii, L.M.,
The Gas-Phase Acidities of Very Strong Neutral Bronsted Acids,
J. Am. Chem. Soc., 1994, 116, 7, 3047, https://doi.org/10.1021/ja00086a038
. [all data]
Meeks, Wahlborg, et al., 1981
Meeks, J.; Wahlborg, A.; McGlynn, S.P.,
Photoelectron spectroscopy of carbonyls: Benzoic acid and its derivatives,
J. Electron Spectrosc. Relat. Phenom., 1981, 22, 43. [all data]
(editor), 1967
(editor), Koptyug V.A.,
Atlas of Spectra of Aromatic and Heterocyclic Compounds, 1967, 1, 61. [all data]
Zheng, 2011
Zheng, Yufang,
Retention Data. NIST Mass Spectrometry Data Center., NIST Mass Spectrometry Data Center, 2011. [all data]