3-Tridecyne
- Formula: C13H24
- Molecular weight: 180.3297
- IUPAC Standard InChIKey: HDLJOUCNTFYRPD-UHFFFAOYSA-N
- CAS Registry Number: 60186-78-9
- Chemical structure:
View 3d structure (requires JavaScript / HTML 5) - Other names: 3-C13H24; 3-Tridecene

Gas phase ion energetics data

Data compiled as indicated in comments:
LLK - Sharon G. Lias, Rhoda D. Levin, and Sherif A. Kafafi
Ionization energy determinations
IE (eV) | Method | Reference | Comment |
---|---|---|---|
9.14 ± 0.03 | PI | Rang and Martinson, 1978 | LLK |

Lee's RI, non-polar column, custom temperature program

Column type | Active phase | I | Reference | Comment |
---|---|---|---|---|
Capillary | DB-5 | 166.8 | Fuentes, Font, et al., 2007 | Column length: 60. m; Program: not specified |

References

Rang and Martinson, 1978
Rang, S.; Martinson, E.,
Ionization potentials of unsaturated hydrocarbons. 3. n-Alkyunes C8-C12.,
Eesti. NSV Tead. Akad. Toim. Keem., 1978, 44. [all data]
Fuentes, Font, et al., 2007
Fuentes, M.J.; Font, R.; Gomez-Rico, M.F.; Martin-Gullon, I.,
Pyrolysis and combustion of waste lubricant oil from diesel cars: Decomposition and pollutants,
J. Anal. Appl. Pyrolysis, 2007, 79, 1-2, 215-226, https://doi.org/10.1016/j.jaap.2006.12.004
. [all data]