2-Propanamine, N-(1-methylethyl)-N-nitroso-
- Formula: C6H14N2O
- Molecular weight: 130.1882
- IUPAC Standard InChIKey: AUIKJTGFPFLMFP-UHFFFAOYSA-N
- CAS Registry Number: 601-77-4
- Chemical structure:
View 3d structure (requires JavaScript / HTML 5) - Other names: Diethylamine, 1,1'-dimethyl-N-nitroso-; Diisopropylnitrosamine; N-Nitrosodiisopropylamine; Diisopropylamine, N-nitroso-; Diisopropylnitrosamin; Nitrosodiisopropylamine

Gas phase ion energetics data

Data compiled by: Sharon G. Lias, Rhoda D. Levin, and Sherif A. Kafafi
Ionization energy determinations
IE (eV) | Method | Reference | Comment |
---|---|---|---|
8.58 | PE | Battiste, Davis, et al., 1975 | Vertical value |

Normal alkane RI, non-polar column, custom temperature program

Column type | Active phase | I | Reference | Comment |
---|---|---|---|---|
Capillary | Methyl Silicone | 979. | Zenkevich, 1999 | Program: not specified |

References

Battiste, Davis, et al., 1975
Battiste, D.R.; Davis, L.P.; Nauman, R.V.,
Photoelectron spectroscopy and quantum chemical analysis of some «N»-nitrosamines,
J. Am. Chem. Soc., 1975, 97, 5071. [all data]
Zenkevich, 1999
Zenkevich, I.G.,
Precalculation of Gas Chromatographic Retention Indices of Organic Compounds from Boiling Points of their Structural Analogues,
Zh. Struct. Khim., 1999, 40, 1, 121-130. [all data]