[2.2.2.2.2.2](1,2,3,4,5,6)Cyclophane
- Formula: C24H24
- Molecular weight: 312.4474
- IUPAC Standard InChIKey: BVTYOCKAKQQPEE-UHFFFAOYSA-N
- CAS Registry Number: 60144-50-5
- Chemical structure:
View 3d structure (requires JavaScript / HTML 5) - Permanent link for this species. Use this link for bookmarking this species for future reference.

Gas phase ion energetics data

Data compiled as indicated in comments:
LLK - Sharon G. Lias, Rhoda D. Levin, and Sherif A. Kafafi
Ionization energy determinations
IE (eV) | Method | Reference | Comment |
---|---|---|---|
7.3 | PE | Kovac, Mohraz, et al., 1980 | LLK |
7.55 ± 0.02 | PE | Kovac, Mohraz, et al., 1980 | Vertical value; LLK |

References

Kovac, Mohraz, et al., 1980
Kovac, B.; Mohraz, M.; Heilbronner, E.; Boekelheide, V.; Hopf, H.,
Photoelectron spectra of the cyclophanes,
J. Am. Chem. Soc., 1980, 102, 4314. [all data]