Piperidine,1-bromo-
- Formula: C5H10BrN
- Molecular weight: 164.044
- IUPAC Standard InChIKey: RRQGZMDHLIAOLY-UHFFFAOYSA-N
- CAS Registry Number: 60094-06-6
- Chemical structure:
View 3d structure (requires JavaScript / HTML 5) - Permanent link for this species. Use this link for bookmarking this species for future reference.

Gas phase ion energetics data

Data compiled by: Sharon G. Lias, Rhoda D. Levin, and Sherif A. Kafafi
Ionization energy determinations
IE (eV) | Method | Reference | Comment |
---|---|---|---|
8.92 ± 0.10 | PE | Gan and Peel, 1979 | Vertical value |

References

Gan and Peel, 1979
Gan, T.-H.; Peel, J.B.,
Photoelectron spectroscopic studies of piperidine and its N-halo derivatives,
Aust. J. Chem., 1979, 32, 475. [all data]