2-Pentanone, 4-methyl-4-nitroso-
- Formula: C6H11NO2
- Molecular weight: 129.1570
- IUPAC Standard InChIKey: DDAFPVRRYUYWAI-UHFFFAOYSA-N
- CAS Registry Number: 60027-50-1
- Chemical structure:
View 3d structure (requires JavaScript / HTML 5) - Permanent link for this species. Use this link for bookmarking this species for future reference.

Gas phase ion energetics data

Data compiled by: Sharon G. Lias, Rhoda D. Levin, and Sherif A. Kafafi
Ionization energy determinations
IE (eV) | Method | Reference | Comment |
---|---|---|---|
8.0 ± 0.1 | PE | Egdell, Green, et al., 1975 | Vertical value |

References

Egdell, Green, et al., 1975
Egdell, R.; Green, J.C.; Rao, C.N.R.; Gowenlock, B.G.; Pfab, J.,
He(I) photoelectron studies of C-nitroso compounds,
J. Chem. Soc. Faraday Trans. 2, 1975, 988. [all data]