Benzene, (ethylsulfonyl)-
- Formula: C8H10O2S
- Molecular weight: 170.229
- IUPAC Standard InChIKey: VBQUDDWATQWCPP-UHFFFAOYSA-N
- CAS Registry Number: 599-70-2
- Chemical structure:
View 3d structure (requires JavaScript / HTML 5) - Other names: Sulfone, ethyl phenyl; Ethyl phenyl sulfone; Phenyl ethyl sulfone; (ethylsulphonyl)benzene

Reaction thermochemistry data

Data compiled by: John E. Bartmess
Individual Reactions
C8H9O2S- + =
By formula: C8H9O2S- + H+ = C8H10O2S
Quantity | Value | Units | Method | Reference | Comment |
---|---|---|---|---|---|
ΔrH° | 1527. ± 8.4 | kJ/mol | G+TS | Cumming and Kebarle, 1978 | gas phase |
Quantity | Value | Units | Method | Reference | Comment |
ΔrG° | 1495. ± 8.4 | kJ/mol | IMRE | Cumming and Kebarle, 1978 | gas phase |

Gas phase ion energetics data

Data compiled as indicated in comments:
B - John E. Bartmess
LLK - Sharon G. Lias, Rhoda D. Levin, and Sherif A. Kafafi
Ionization energy determinations
IE (eV) | Method | Reference | Comment |
---|---|---|---|
9.4 | PE | Mohraz, Jian-qi, et al., 1981 | LLK |
9.75 | PE | Mohraz, Jian-qi, et al., 1981 | Vertical value; LLK |
De-protonation reactions
C8H9O2S- + =
By formula: C8H9O2S- + H+ = C8H10O2S
Quantity | Value | Units | Method | Reference | Comment |
---|---|---|---|---|---|
ΔrH° | 1527. ± 8.4 | kJ/mol | G+TS | Cumming and Kebarle, 1978 | gas phase; B |
Quantity | Value | Units | Method | Reference | Comment |
ΔrG° | 1495. ± 8.4 | kJ/mol | IMRE | Cumming and Kebarle, 1978 | gas phase; B |

References

Cumming and Kebarle, 1978
Cumming, J.B.; Kebarle, P.,
Summary of gas phase measurements involving acids AH. Entropy changes in proton transfer reactions involving negative ions. Bond dissociation energies D(A-H) and electron affinities EA(A),
Can. J. Chem., 1978, 56, 1. [all data]
Mohraz, Jian-qi, et al., 1981
Mohraz, M.; Jian-qi, W.; Heilbronner, E.; Solladie-Cavallo, A.; Matloubi-Moghadam, F.,
11. Some comments on the conformations of methyl phenyl sulfides, sulfoxides and sulfones,
Helv. Chim. Acta, 1981, 64, 97. [all data]