di-p-Tolyl sulfone
- Formula: C14H14O2S
- Molecular weight: 246.325
- IUPAC Standard InChIKey: WEAYCYAIVOIUMG-UHFFFAOYSA-N
- CAS Registry Number: 599-66-6
- Chemical structure:
View 3d structure (requires JavaScript / HTML 5) - Other names: Bis(4-methylphenyl) sulfone; Benzene, 1,1'-sulfonylbis(4-methyl-; p-Tolyl sulfone; p,p'-Ditolyl sulfone; Sulfone, di-p-tolyl; 4,4'-Dimethyldiphenylsulfone; 4,4'-Ditolyl sulfone; Bis(p-tolyl) sulfone; NSC 208; di-p-tolyl sulphone; Benzene, 1,1'-sulfonylbis(4-methyl-)

Gas phase thermochemistry data

Data compiled by: Hussein Y. Afeefy, Joel F. Liebman, and Stephen E. Stein
Quantity | Value | Units | Method | Reference | Comment |
---|---|---|---|---|---|
ΔfH°gas | -202. ± 3. | kJ/mol | Ccr | Mackle and O'Hare, 1961 | Haet of combustion corrected for pressure |

Condensed phase thermochemistry data

Data compiled by: Hussein Y. Afeefy, Joel F. Liebman, and Stephen E. Stein
Quantity | Value | Units | Method | Reference | Comment |
---|---|---|---|---|---|
ΔfH°solid | -311.4 ± 0.8 | kJ/mol | Ccr | Mackle and O'Hare, 1961 | Haet of combustion corrected for pressure |
Quantity | Value | Units | Method | Reference | Comment |
ΔcH°solid | -7800.65 ± 0.50 | kJ/mol | Ccr | Mackle and O'Hare, 1961 | Haet of combustion corrected for pressure |

Phase change data

Data compiled as indicated in comments:
TRC - Thermodynamics Research Center, NIST Boulder Laboratories, Chris Muzny director
ALS - Hussein Y. Afeefy, Joel F. Liebman, and Stephen E. Stein
Quantity | Value | Units | Method | Reference | Comment |
---|---|---|---|---|---|
Tfus | 421.9 | K | N/A | Olah and Gupta, 1983 | Uncertainty assigned by TRC = 1.5 K; TRC |
Tfus | 429. | K | N/A | Graybill, 1967 | Uncertainty assigned by TRC = 3. K; TRC |
Quantity | Value | Units | Method | Reference | Comment |
ΔsubH° | 110. ± 2. | kJ/mol | V | Mackle and O'Hare, 1961 | Haet of combustion corrected for pressure; ALS |

Gas phase ion energetics data

Data compiled as indicated in comments:
LLK - Sharon G. Lias, Rhoda D. Levin, and Sherif A. Kafafi
Ionization energy determinations
IE (eV) | Method | Reference | Comment |
---|---|---|---|
8.66 ± 0.04 | PI | Evlasheva, Puchkova, et al., 1975 | LLK |

References

Mackle and O'Hare, 1961
Mackle, H.; O'Hare, P.A.G.,
Studies in the thermochemistry of sulphones. Part 6 - Heats of combustion, fusion, vaporization and atomization of six aromatic and two allylic sulphones,
Trans. Faraday Soc., 1961, 57, 1521-1526. [all data]
Olah and Gupta, 1983
Olah, G.A.; Gupta, B.G.B.,
Onium Ions 27. Oxidation of Sulfoxides to Sulfones with Nitronium Salts,
J. Org. Chem., 1983, 48, 3585-7. [all data]
Graybill, 1967
Graybill, B.M.,
The Syntheses of Aryl Sulfones,
J. Org. Chem., 1967, 32, 2931-3. [all data]
Evlasheva, Puchkova, et al., 1975
Evlasheva, T.I.; Puchkova, V.V.; Potapov, V.K.; Gur'yanova, E.N.,
Ionisation potentials and electron-donating properties of sulphones,
Russ. J. Phys. Chem., 1975, 49, 453. [all data]