Benzene,[(3-phenoxypropyl)thio]-
- Formula: C15H16OS
- Molecular weight: 244.352
- IUPAC Standard InChIKey: DYESPVOVFYSSGL-UHFFFAOYSA-N
- CAS Registry Number: 59950-10-6
- Chemical structure:
View 3d structure (requires JavaScript / HTML 5) - Permanent link for this species. Use this link for bookmarking this species for future reference.

Gas phase ion energetics data

Data compiled by: Sharon G. Lias, Rhoda D. Levin, and Sherif A. Kafafi
Ionization energy determinations
IE (eV) | Method | Reference |
---|---|---|
8.21 ± 0.05 | EI | Schwarz, Petersen, et al., 1977 |

References

Schwarz, Petersen, et al., 1977
Schwarz, H.; Petersen, R.D.; Van De Sande, C.C.,
Entropische und energetische Effekte bei der Bildung cyclischer Oxonium-, Sulfonium- und Bromonium-Ionen aus ωsubstituierten Phenoxyalkanen,
Org. Mass Spectrom., 1977, 12, 391. [all data]