D-Limonene
- Formula: C10H16
- Molecular weight: 136.2340
- IUPAC Standard InChIKey: XMGQYMWWDOXHJM-SNVBAGLBSA-N
- CAS Registry Number: 5989-27-5
- Chemical structure:
View 3d structure (requires JavaScript / HTML 5) - Stereoisomers:
- Other names: Cyclohexene, 1-methyl-4-(1-methylethenyl)-, (R)-; p-Mentha-1,8-diene, (R)-(+)-; (+)-(R)-Limonene; (+)-(4R)-Limonene; (+)-p-Mentha-1,8-diene; (+)-Limonene; (R)-(+)-Limonene; Carvene; D-(+)-Limonene; Limonene, (D)-; Limonene, (+)-; (R)-1-methyl-4-(1-methylethenyl)cyclohexene; Dextro-limonene; (R)-4-Isopropenyl-1-methyl-1-cyclohexene; 4-Isopropenyl-1-methyl-1-cyclohexene-, (R)-; (R)-Limonene; (+)-Dipentene; (4R)-(+)-Limonene; (4R)-Limonene; (R)-(+)-p-Mentha-1,8-diene; (R)-p-Mentha-1,8-diene; Biogenic SE 374; Cyclohexene, 1-methyl-4-(1-methylethenyl)-, (4R)-; EC 7; Glidesafe; Glidsafe; Refchole

Condensed phase thermochemistry data

Data compiled by: Hussein Y. Afeefy, Joel F. Liebman, and Stephen E. Stein
Quantity | Value | Units | Method | Reference | Comment |
---|---|---|---|---|---|
ΔcH°liquid | -6167.2 ± 2.1 | kJ/mol | Ccb | Hawkins and Eriksen, 1954 | Reanalyzed by Cox and Pilcher, 1970, Original value = -6166.8 ± 1.1 kJ/mol; Corresponding ΔfHºliquid = -54.52 kJ/mol (simple calculation by NIST; no Washburn corrections) |

Phase change data

Data compiled as indicated in comments:
BS - Robert L. Brown and Stephen E. Stein
TRC - Thermodynamics Research Center, NIST Boulder Laboratories, Chris Muzny director
AC - William E. Acree, Jr., James S. Chickos
Quantity | Value | Units | Method | Reference | Comment |
---|---|---|---|---|---|
Tboil | 450. ± 2. | K | AVG | N/A | Average of 18 values; Individual data points |
Quantity | Value | Units | Method | Reference | Comment |
Tfus | 198.65 | K | N/A | Gomes, Serrano, et al., 1988 | Uncertainty assigned by TRC = 0.15 K; TRC |
Quantity | Value | Units | Method | Reference | Comment |
ΔvapH° | 49.5 | kJ/mol | N/A | Clara, Marigliano, et al., 2009 | Based on data from 326. to 445. K.; AC |
ΔvapH° | 49.6 | kJ/mol | GC | Hoskovec, Grygarová, et al., 2005 | Based on data from 313. to 413. K.; AC |
ΔvapH° | 49.9 | kJ/mol | GC | van Roon, Parsons, et al., 2002 | AC |
ΔvapH° | 49.6 | kJ/mol | CGC | Chickos, Hosseini, et al., 1995 | Based on data from 373. to 423. K.; AC |
ΔvapH° | 48.9 ± 0.1 | kJ/mol | C | Atik, Saito, et al., 1987 | AC |
Enthalpy of vaporization
ΔvapH (kJ/mol) | Temperature (K) | Method | Reference | Comment |
---|---|---|---|---|
46.1 ± 0.2 | 350. | EB | Steele, Chirico, et al., 2002 | Based on data from 339. to 495. K.; AC |
43.5 ± 0.2 | 390. | EB | Steele, Chirico, et al., 2002 | Based on data from 339. to 495. K.; AC |
40.9 ± 0.3 | 430. | EB | Steele, Chirico, et al., 2002 | Based on data from 339. to 495. K.; AC |
37.9 ± 0.6 | 470. | EB | Steele, Chirico, et al., 2002 | Based on data from 339. to 495. K.; AC |
49.2 | 300. | N/A | Espinosa Diaz, Guetachew, et al., 1999 | Based on data from 250. to 434. K.; AC |
44.5 | 302. | A | Stephenson and Malanowski, 1987 | Based on data from 287. to 448. K.; AC |
47.7 | 303. | A | Stephenson and Malanowski, 1987 | Based on data from 288. to 323. K.; AC |
Enthalpy of fusion
ΔfusH (kJ/mol) | Temperature (K) | Reference | Comment |
---|---|---|---|
11.38 | 199.2 | Gallis, van den Berg, et al., 1996 | See also Gallis, van den Berg, et al., 1996.; AC |

References

Hawkins and Eriksen, 1954
Hawkins, J.E.; Eriksen, W.T.,
Physical and thermodynamic properties of terpenes. II. The heats of combustion of some terpene hydrocarbons,
J. Am. Chem. Soc., 1954, 76, 2669-26. [all data]
Cox and Pilcher, 1970
Cox, J.D.; Pilcher, G.,
Thermochemistry of Organic and Organometallic Compounds, Academic Press, New York, 1970, 1-636. [all data]
Gomes, Serrano, et al., 1988
Gomes, A.; Serrano, L.; Fareio, F.,
Solid-Liquid Equilibria in 1,8-Cineole/TErpenic Hydrocarbon Systems,
J. Chem. Eng. Data, 1988, 33, 194. [all data]
Clara, Marigliano, et al., 2009
Clara, Rene A.; Marigliano, Ana C. Gomez; Solimo, Horacio N.,
Density, Viscosity, and Refractive Index in the Range (283.15 to 353.15) K and Vapor Pressure of α-Pinene, d -Limonene, (±)-Linalool, and Citral Over the Pressure Range 1.0 kPa Atmospheric Pressure,
J. Chem. Eng. Data, 2009, 54, 3, 1087-1090, https://doi.org/10.1021/je8007414
. [all data]
Hoskovec, Grygarová, et al., 2005
Hoskovec, Michal; Grygarová, Dana; Cvacka, Josef; Streinz, Ludvík; Zima, Jirí; Verevkin, Sergey P.; Koutek, Bohumír,
Determining the vapour pressures of plant volatiles from gas chromatographic retention data,
Journal of Chromatography A, 2005, 1083, 1-2, 161-172, https://doi.org/10.1016/j.chroma.2005.06.006
. [all data]
van Roon, Parsons, et al., 2002
van Roon, André; Parsons, John R.; Govers, Harrie A.J.,
Gas chromatographic determination of vapour pressure and related thermodynamic properties of monoterpenes and biogenically related compounds,
Journal of Chromatography A, 2002, 955, 1, 105-115, https://doi.org/10.1016/S0021-9673(02)00200-5
. [all data]
Chickos, Hosseini, et al., 1995
Chickos, James S.; Hosseini, Sarah; Hesse, Donald G.,
Determination of vaporization enthalpies of simple organic molecules by correlations of changes in gas chromatographic net retention times,
Thermochimica Acta, 1995, 249, 41-62, https://doi.org/10.1016/0040-6031(95)90670-3
. [all data]
Atik, Saito, et al., 1987
Atik, Zadjia; Saito, Yoshihiro; Kusano, Kazuhito,
Thermodynamic properties of liquid enantiomers I. Enthalpies of vaporization of fenchones, α-methylbenzylamines, and limonenes at 298.15 K,
The Journal of Chemical Thermodynamics, 1987, 19, 1, 99-102, https://doi.org/10.1016/0021-9614(87)90167-4
. [all data]
Steele, Chirico, et al., 2002
Steele, W.V.; Chirico, R.D.; Cowell, A.B.; Knipmeyer, S.E.; Nguyen, A.,
Thermodynamic Properties and Ideal-Gas Enthalpies of Formation for Methyl Benzoate, Ethyl Benzoate, ( R )-(+)-Limonene, tert -Amyl Methyl Ether, trans -Crotonaldehyde, and Diethylene Glycol,
J. Chem. Eng. Data, 2002, 47, 4, 667-688, https://doi.org/10.1021/je0100847
. [all data]
Espinosa Diaz, Guetachew, et al., 1999
Espinosa Diaz, M.A.; Guetachew, T.; Landy, P.; Jose, J.; Voilley, A.,
Experimental and estimated saturated vapour pressures of aroma compounds,
Fluid Phase Equilibria, 1999, 157, 2, 257-270, https://doi.org/10.1016/S0378-3812(99)00016-3
. [all data]
Stephenson and Malanowski, 1987
Stephenson, Richard M.; Malanowski, Stanislaw,
Handbook of the Thermodynamics of Organic Compounds, 1987, https://doi.org/10.1007/978-94-009-3173-2
. [all data]
Gallis, van den Berg, et al., 1996
Gallis, H.E.; van den Berg, G.J.K.; Oonk, H.A.J.,
Thermodynamic Properties of Crystalline d -Limonene Determined by Adiabatic Calorimetry,
J. Chem. Eng. Data, 1996, 41, 6, 1303-1306, https://doi.org/10.1021/je960094l
. [all data]