2-Bromopropanoic acid
- Formula: C3H5BrO2
- Molecular weight: 152.975
- IUPAC Standard InChIKey: MONMFXREYOKQTI-UHFFFAOYSA-N
- CAS Registry Number: 598-72-1
- Chemical structure:
View 3d structure (requires JavaScript / HTML 5) - Species with the same structure:
- Other names: α-Bromopropionic acid; 2-Bromopropionic acid; Propanoic acid, 2-bromo-; Propionic acid, 2-bromo-

Phase change data

Data compiled by: Robert L. Brown and Stephen E. Stein
Quantity | Value | Units | Method | Reference | Comment |
---|---|---|---|---|---|
Tboil | 476.2 | K | N/A | Aldrich Chemical Company Inc., 1990 |

Reaction thermochemistry data

Data compiled by: John E. Bartmess
Individual Reactions
C3H4BrO2- + =
By formula: C3H4BrO2- + H+ = C3H5BrO2
Quantity | Value | Units | Method | Reference | Comment |
---|---|---|---|---|---|
ΔrH° | 1409. ± 8.8 | kJ/mol | G+TS | Caldwell, Renneboog, et al., 1989 | gas phase |
ΔrH° | 1407. ± 8.8 | kJ/mol | G+TS | Caldwell, McMahon, et al., 1985 | gas phase |
Quantity | Value | Units | Method | Reference | Comment |
ΔrG° | 1380. ± 8.4 | kJ/mol | IMRE | Caldwell, Renneboog, et al., 1989 | gas phase |
ΔrG° | 1377. ± 8.4 | kJ/mol | IMRE | Caldwell, McMahon, et al., 1985 | gas phase |

Gas phase ion energetics data

Data compiled as indicated in comments:
B - John E. Bartmess
LL - Sharon G. Lias and Joel F. Liebman
LBLHLM - Sharon G. Lias, John E. Bartmess, Joel F. Liebman, John L. Holmes, Rhoda D. Levin, and W. Gary Mallard
Appearance energy determinations
Ion | AE (eV) | Other Products | Method | Reference | Comment |
---|---|---|---|---|---|
CHO2+ | 11.82 | BrCHCH3 | EI | Holmes and Lossing, 1988 | LL |
C2H5Br+ | 10.70 | CO2 | EI | Blanchette, Holmes, et al., 1987 | LBLHLM |
De-protonation reactions
C3H4BrO2- + =
By formula: C3H4BrO2- + H+ = C3H5BrO2
Quantity | Value | Units | Method | Reference | Comment |
---|---|---|---|---|---|
ΔrH° | 1409. ± 8.8 | kJ/mol | G+TS | Caldwell, Renneboog, et al., 1989 | gas phase; B |
ΔrH° | 1407. ± 8.8 | kJ/mol | G+TS | Caldwell, McMahon, et al., 1985 | gas phase; B |
Quantity | Value | Units | Method | Reference | Comment |
ΔrG° | 1380. ± 8.4 | kJ/mol | IMRE | Caldwell, Renneboog, et al., 1989 | gas phase; B |
ΔrG° | 1377. ± 8.4 | kJ/mol | IMRE | Caldwell, McMahon, et al., 1985 | gas phase; B |

References

Aldrich Chemical Company Inc., 1990
Aldrich Chemical Company Inc.,
Catalog Handbook of Fine Chemicals, Aldrich Chemical Company, Inc., Milwaukee WI, 1990, 1. [all data]
Caldwell, Renneboog, et al., 1989
Caldwell, G.; Renneboog, R.; Kebarle, P.,
Gas Phase Acidities of Aliphatic Carboxylic Acids, Based on Measurements of Proton Transfer Equilibria,
Can. J. Chem., 1989, 67, 4, 661, https://doi.org/10.1139/v89-092
. [all data]
Caldwell, McMahon, et al., 1985
Caldwell, G.; McMahon, T.B.; Kebarle, P.; Bartmess, J.E.; Kiplinger, J.P.,
Methyl substituent effects in the gas phase acidities of halosubstituted oxygen acids. A realignment with substituent effects in solution,
J. Am. Chem. Soc., 1985, 107, 80. [all data]
Holmes and Lossing, 1988
Holmes, J.L.; Lossing, F.P.,
Heats of formation and bond dissociation energies in halogen-substituted methyl and ethyl radicals,
J. Am. Chem. Soc., 1988, 110, 7343. [all data]
Blanchette, Holmes, et al., 1987
Blanchette, M.C.; Holmes, J.L.; Lossing, F.P.,
The ethyl halides: Stable neutral and radical cation isomers [C2, H5, X] where X = F, Cl, Br, I,
Org. Mass Spectrom., 1987, 22, 701. [all data]