Cyclobutane, methyl-
- Formula: C5H10
- Molecular weight: 70.1329
- IUPAC Standard InChIKey: BDJAEZRIGNCQBZ-UHFFFAOYSA-N
- CAS Registry Number: 598-61-8
- Chemical structure:
View 3d structure (requires JavaScript / HTML 5) - Other names: Methylcyclobutane; 1-Methylcyclobutane

Gas phase thermochemistry data

Data compiled as indicated in comments:
ALS - Hussein Y. Afeefy, Joel F. Liebman, and Stephen E. Stein
GT - Glushko Thermocenter, Russian Academy of Sciences, Moscow
Quantity | Value | Units | Method | Reference | Comment |
---|---|---|---|---|---|
ΔcH°gas | -3352. ± 1.3 | kJ/mol | Ccb | Humphrey and Spitzer, 1950 | Corresponding ΔfHºgas = -44.8 kJ/mol (simple calculation by NIST; no Washburn corrections); ALS |
Constant pressure heat capacity of gas
Cp,gas (J/mol*K) | Temperature (K) | Reference | Comment |
---|---|---|---|
36.11 | 50. | Thermodynamics Research Center, 1997 | p=1 bar.; GT |
48.84 | 100. | ||
60.02 | 150. | ||
70.79 | 200. | ||
90.58 | 273.15 | ||
98.32 | 298.15 | ||
98.90 | 300. | ||
130.8 | 400. | ||
159.8 | 500. | ||
184.3 | 600. | ||
204.8 | 700. | ||
222.3 | 800. | ||
237.3 | 900. | ||
250.2 | 1000. | ||
261.3 | 1100. | ||
270.9 | 1200. | ||
279.3 | 1300. | ||
286.5 | 1400. | ||
292.8 | 1500. | ||
305.2 | 1750. | ||
314.2 | 2000. | ||
320.9 | 2250. | ||
326.0 | 2500. | ||
329.9 | 2750. | ||
332.9 | 3000. |

Phase change data

Data compiled as indicated in comments:
BS - Robert L. Brown and Stephen E. Stein
TRC - Thermodynamics Research Center, NIST Boulder Laboratories, Chris Muzny director
AC - William E. Acree, Jr., James S. Chickos
Quantity | Value | Units | Method | Reference | Comment |
---|---|---|---|---|---|
Tboil | 312. ± 4. | K | AVG | N/A | Average of 7 values; Individual data points |
Enthalpy of fusion
ΔfusH (kJ/mol) | Temperature (K) | Reference | Comment |
---|---|---|---|
5.76 | 138.6 | Acree, 1991 | AC |

Reaction thermochemistry data

Data compiled by: Hussein Y. Afeefy, Joel F. Liebman, and Stephen E. Stein
Individual Reactions
Quantity | Value | Units | Method | Reference | Comment |
---|---|---|---|---|---|
ΔrH° | -123.1 ± 0.3 | kJ/mol | Chyd | Turner, Goebel, et al., 1968 | liquid phase; solvent: Acetic acid |
Quantity | Value | Units | Method | Reference | Comment |
---|---|---|---|---|---|
ΔrH° | -119.2 ± 0.04 | kJ/mol | Chyd | Turner, Goebel, et al., 1968 | liquid phase; solvent: Acetic acid |

Gas phase ion energetics data

Data compiled as indicated in comments:
LL - Sharon G. Lias and Joel F. Liebman
LLK - Sharon G. Lias, Rhoda D. Levin, and Sherif A. Kafafi
Ionization energy determinations
IE (eV) | Method | Reference | Comment |
---|---|---|---|
9.64 ± 0.05 | EI | Holmes and Lossing, 1991 | LL |
9.60 | PE | Bischof, Gleiter, et al., 1974 | LLK |

Kovats' RI, non-polar column, isothermal

Column type | Active phase | Temperature (C) | I | Reference | Comment |
---|---|---|---|---|---|
Capillary | Squalane | 50. | 535.5 | Lunskii and Paizanskaya, 1988 | He; Column length: 50. m; Column diameter: 0.22 mm |
Capillary | Squalane | 70. | 538.9 | Lunskii and Paizanskaya, 1988 | He; Column length: 50. m; Column diameter: 0.22 mm |

Normal alkane RI, non-polar column, custom temperature program

Column type | Active phase | I | Reference | Comment |
---|---|---|---|---|
Capillary | Methyl Silicone | 513. | Zenkevich, 1996 | Program: not specified |

References

Humphrey and Spitzer, 1950
Humphrey, G.I.; Spitzer, R.,
Bond hybridization in the non-tetrahedral carbon atom. The heats of combustion of spiro-pentane and methylcyclobutane,
J. Chem. Phys., 1950, 18, 902. [all data]
Thermodynamics Research Center, 1997
Thermodynamics Research Center,
Selected Values of Properties of Chemical Compounds., Thermodynamics Research Center, Texas A&M University, College Station, Texas, 1997. [all data]
Acree, 1991
Acree, William E.,
Thermodynamic properties of organic compounds: enthalpy of fusion and melting point temperature compilation,
Thermochimica Acta, 1991, 189, 1, 37-56, https://doi.org/10.1016/0040-6031(91)87098-H
. [all data]
Turner, Goebel, et al., 1968
Turner, R.B.; Goebel, P.; Mallon, B.J.; Doering, W.E.; Coburn, J.F., Jr.; Pomerantz, M.,
Heats of hydrogenation. VIII. Compounds with three- and four-membered rings,
J. Am. Chem. Soc., 1968, 90, 4315-4322. [all data]
Holmes and Lossing, 1991
Holmes, J.L.; Lossing, F.P.,
Ionization energies of homologous organic compounds and correlation with molecular size,
Org. Mass Spectrom., 1991, 26, 537. [all data]
Bischof, Gleiter, et al., 1974
Bischof, P.; Gleiter, R.; de Meijere, A.; Meyer, L.-U.,
The conjugative interaction between π-orbitals and cyclobutane-orbitals in spiro[3.4]octa-5,7-diene and spiro[3.4]octene-5,
Helv. Chim. Acta, 1974, 57, 1519. [all data]
Lunskii and Paizanskaya, 1988
Lunskii, M.Kh.; Paizanskaya, I.L.,
Identification of hydrocarbons C1-C9 of petrol fractions of oils and condensates in the use of capillary columns with dinonylphthalate,
Zh. Anal. Khim., 1988, 43, 127-135. [all data]
Zenkevich, 1996
Zenkevich, I.G.,
Informational Maitenance of Gas Chromatographic Identification of Organic Compounds in Ecoanalytical Investigations,
Z. Anal. Chem., 1996, 51, 11, 1140-1148. [all data]