Methyl nitrate
- Formula: CH3NO3
- Molecular weight: 77.0394
- IUPAC Standard InChIKey: LRMHVVPPGGOAJQ-UHFFFAOYSA-N
- CAS Registry Number: 598-58-3
- Chemical structure:
View 3d structure (requires JavaScript / HTML 5) - Other names: Nitric acid, methyl ester; CH3ONO2; Methylester kyseliny dusicne

Gas phase thermochemistry data

Data compiled by: Hussein Y. Afeefy, Joel F. Liebman, and Stephen E. Stein
Quantity | Value | Units | Method | Reference | Comment |
---|---|---|---|---|---|
ΔfH°gas | -122. ± 1. | kJ/mol | Cm | Ray and Ogg, 1959 |

Condensed phase thermochemistry data

Data compiled by: Eugene S. Domalski and Elizabeth D. Hearing
Quantity | Value | Units | Method | Reference | Comment |
---|---|---|---|---|---|
S°liquid | 216.98 | J/mol*K | N/A | Gray and Smith, 1953 |
Constant pressure heat capacity of liquid
Cp,liquid (J/mol*K) | Temperature (K) | Reference | Comment |
---|---|---|---|
157.19 | 298.2 | Gray and Smith, 1953 | T = 13 to 295 K. |

Phase change data

Data compiled as indicated in comments:
TRC - Thermodynamics Research Center, NIST Boulder Laboratories, Chris Muzny director
ALS - Hussein Y. Afeefy, Joel F. Liebman, and Stephen E. Stein
AC - William E. Acree, Jr., James S. Chickos
DH - Eugene S. Domalski and Elizabeth D. Hearing
Quantity | Value | Units | Method | Reference | Comment |
---|---|---|---|---|---|
Tboil | 338.0 | K | N/A | Lecat, 1947 | Uncertainty assigned by TRC = 0.5 K; TRC |
Tboil | 338.15 | K | N/A | Rogowski, 1942 | Uncertainty assigned by TRC = 1.5 K; TRC |
Tboil | 338.15 | K | N/A | Perkin, 1889 | Uncertainty assigned by TRC = 1.5 K; TRC |
Quantity | Value | Units | Method | Reference | Comment |
Ttriple | 190.2 | K | N/A | Gray and Smith, 1953, 2 | Uncertainty assigned by TRC = 0.1 K; TRC |
Quantity | Value | Units | Method | Reference | Comment |
ΔvapH° | 34.10 | kJ/mol | V | Gray and Pratt, 1957 | ALS |
Enthalpy of vaporization
ΔvapH (kJ/mol) | Temperature (K) | Method | Reference | Comment |
---|---|---|---|---|
34.8 | 288. | A | Stephenson and Malanowski, 1987 | Based on data from 273. to 303. K.; AC |
Enthalpy of fusion
ΔfusH (kJ/mol) | Temperature (K) | Reference | Comment |
---|---|---|---|
8.242 | 190.2 | Gray and Smith, 1953 | DH |
8.24 | 190.2 | Domalski and Hearing, 1996 | AC |
Entropy of fusion
ΔfusS (J/mol*K) | Temperature (K) | Reference | Comment |
---|---|---|---|
43.33 | 190.2 | Gray and Smith, 1953 | DH |

Reaction thermochemistry data

Data compiled by: Hussein Y. Afeefy, Joel F. Liebman, and Stephen E. Stein
Individual Reactions
By formula: 0.76NO2 + 0.62N2O4 + CH3NO3 = N2O5 + CH3NO2
Quantity | Value | Units | Method | Reference | Comment |
---|---|---|---|---|---|
ΔrH° | 36.24 | kJ/mol | Cm | Ray and Ogg, 1959 | liquid phase |
By formula: CH4O + HNO3 = CH3NO3 + H2O
Quantity | Value | Units | Method | Reference | Comment |
---|---|---|---|---|---|
ΔrH° | -27.6 | kJ/mol | Eqk | Rubtsov, 1986 | liquid phase |

Henry's Law data

Data compiled by: Rolf Sander
Henry's Law constant (water solution)
kH(T) = k°H exp(d(ln(kH))/d(1/T) ((1/T) - 1/(298.15 K)))
k°H = Henry's law constant for solubility in water at 298.15 K (mol/(kg*bar))
d(ln(kH))/d(1/T) = Temperature dependence constant (K)
k°H (mol/(kg*bar)) | d(ln(kH))/d(1/T) (K) | Method | Reference |
---|---|---|---|
2.0 | 4700. | M | N/A |

Gas phase ion energetics data

Data evaluated as indicated in comments:
HL - Edward P. Hunter and Sharon G. Lias
Data compiled as indicated in comments:
RDSH - Henry M. Rosenstock, Keith Draxl, Bruce W. Steiner, and John T. Herron
Quantity | Value | Units | Method | Reference | Comment |
---|---|---|---|---|---|
Proton affinity (review) | 733.6 | kJ/mol | N/A | Hunter and Lias, 1998 | HL |
Quantity | Value | Units | Method | Reference | Comment |
Gas basicity | 714.8 | kJ/mol | N/A | Hunter and Lias, 1998 | HL |
Ionization energy determinations
IE (eV) | Method | Reference | Comment |
---|---|---|---|
11.53 ± 0.01 | PE | Dewar, Shanshal, et al., 1969 | RDSH |
Appearance energy determinations
Ion | AE (eV) | Other Products | Method | Reference | Comment |
---|---|---|---|---|---|
CH2NO3+ | 11.7 | H | EI | Fraser and Paul, 1968 | RDSH |
CH3+ | 15.5 | ? | EI | Fraser and Paul, 1968 | RDSH |
NO2+ | 12.3 | CH3O | EI | Fraser and Paul, 1968 | RDSH |

Van Den Dool and Kratz RI, non-polar column, temperature ramp

View large format table.

Column type Active phase I Reference Comment
CapillaryDB-1525.Helmig, Pollock, et al., 199630. m/0.25 mm/1. μm, 6. K/min; Tstart: -50. C; Tend: 180. C
CapillaryDB-5548.Helmig, Pollock, et al., 199660. m/0.33 mm/0.25 μm, 6. K/min; Tstart: -50. C; Tend: 180. C

References

Ray and Ogg, 1959
Ray, J.D.; Ogg, R.A., Jr.,
The heat of formation of methyl nitrate,
J. Phys. Chem., 1959, 63, 1522-1523. [all data]
Gray and Smith, 1953
Gray, P.; Smith, P.L.,
The thermodynamic properties of methyl nitrate,
J. Chem. Soc., 1953, 1953, 2380-2385. [all data]
Lecat, 1947
Lecat, M.,
Orthobaric Azeotropes of Sulfides,
Bull. Cl. Sci., Acad. R. Belg., 1947, 33, 160-82. [all data]
Rogowski, 1942
Rogowski, F.,
Molecular Structure of Nitromethane, Methyl Nitrite and Methyl Nitrate in the Gas State by Electron Diffraction,
Chem. Ber., 1942, 75, 244. [all data]
Perkin, 1889
Perkin, W.H.,
The Magneto Rotatory Power of Nitrogne Compounds. also of Hydrochloric Hydrobromic and Hydroioidic Acids and of some of the Salts of Ammonia and the Compound Ammonias,
J. Chem. Soc., 1889, 55, 680. [all data]
Gray and Smith, 1953, 2
Gray, P.; Smith, P.L.,
The thermodynamic properties of methyl nitrate,
J. Chem. Soc., 1953, 1953, 2380-85. [all data]
Gray and Pratt, 1957
Gray, P.; Pratt, M.W.T.,
The latent heats of vaporization of the alkyl nitrates,
J. Chem. Soc., 1957, 2163-21. [all data]
Stephenson and Malanowski, 1987
Stephenson, Richard M.; Malanowski, Stanislaw,
Handbook of the Thermodynamics of Organic Compounds, 1987, https://doi.org/10.1007/978-94-009-3173-2
. [all data]
Domalski and Hearing, 1996
Domalski, Eugene S.; Hearing, Elizabeth D.,
Heat Capacities and Entropies of Organic Compounds in the Condensed Phase. Volume III,
J. Phys. Chem. Ref. Data, 1996, 25, 1, 1, https://doi.org/10.1063/1.555985
. [all data]
Rubtsov, 1986
Rubtsov, Yu.I.,
Thermodynamic calculation of equilibrium in nitration of alcohols,
Bull. Acad. Sci. USSR, Div. Chem. Sci., 1986, 19-22. [all data]
Hunter and Lias, 1998
Hunter, E.P.; Lias, S.G.,
Evaluated Gas Phase Basicities and Proton Affinities of Molecules: An Update,
J. Phys. Chem. Ref. Data, 1998, 27, 3, 413-656, https://doi.org/10.1063/1.556018
. [all data]
Dewar, Shanshal, et al., 1969
Dewar, M.J.S.; Shanshal, M.; Worley, S.D.,
Calculated and observed ionization potentials gf nitroalkanes and of nitrous and nitric acids and esters. Extension of the MINDO method to nitrogen-oxygen compounds,
J. Am. Chem. Soc., 1969, 91, 3590. [all data]
Fraser and Paul, 1968
Fraser, R.T.M.; Paul, N.C.,
The mass spectrometry of nitrate esters and related compounds. Part I,
J. Chem. Soc. B, 1968, 659. [all data]