Thiourea, methyl-
- Formula: C2H6N2S
- Molecular weight: 90.147
- IUPAC Standard InChIKey: KQJQICVXLJTWQD-UHFFFAOYSA-N
- CAS Registry Number: 598-52-7
- Chemical structure:

Phase change data

Data compiled by: William E. Acree, Jr., James S. Chickos
Quantity | Value | Units | Method | Reference | Comment |
---|---|---|---|---|---|
ΔsubH° | 27.0 ± 0.7 | kcal/mol | ME | Della Gatta, Józwiak, et al., 2000 |
Enthalpy of sublimation
ΔsubH (kcal/mol) | Temperature (K) | Method | Reference |
---|---|---|---|
26.5 ± 0.72 | 381. | TE | Ferro, Martino, et al., 1994 |
Enthalpy of fusion
ΔfusH (kcal/mol) | Temperature (K) | Reference |
---|---|---|
4.651 | 392.4 | Della Gatta, Józwiak, et al., 2000 |

Gas phase ion energetics data

Data compiled as indicated in comments:
RDSH - Henry M. Rosenstock, Keith Draxl, Bruce W. Steiner, and John T. Herron
LLK - Sharon G. Lias, Rhoda D. Levin, and Sherif A. Kafafi
Ionization energy determinations
IE (eV) | Method | Reference | Comment |
---|---|---|---|
8.29 ± 0.05 | EI | Baldwin, Maccoll, et al., Ind. 1966 | RDSH |
Appearance energy determinations
Ion | AE (eV) | Other Products | Method | Reference | Comment |
---|---|---|---|---|---|
CH2NS+ | 12.45 | ? | EI | Loudon and Webb, 1977 | LLK |
CH4N+ | 11.10 | ? | EI | Loudon and Webb, 1977 | LLK |

References

Della Gatta, Józwiak, et al., 2000
Della Gatta, Giuseppe; Józwiak, Malgorzata; Brunetti, Bruno; Abate, Lorenzo,
Enthalpies and entropies of fusion and of sublimation at the temperature 298.15 K of thiourea and sevenN-alkylthioureas,
The Journal of Chemical Thermodynamics, 2000, 32, 8, 979-997, https://doi.org/10.1006/jcht.2000.0662
. [all data]
Ferro, Martino, et al., 1994
Ferro, Daniela; Martino, Rosalba; Gatta, Giuseppe Della,
Sublimation enthalpies and entropies of thiourea, 1-methyl-2-thiourea, 1,3-dimethyl-2-thiourea, and 1,1,3,3-tetramethyl-2-thiourea,
The Journal of Chemical Thermodynamics, 1994, 26, 2, 183-190, https://doi.org/10.1006/jcht.1994.1037
. [all data]
Baldwin, Maccoll, et al., Ind. 1966
Baldwin, M.; Maccoll, A.; Kirkien-Konasiewicz, A.; Saville, B.,
Ionisation potentials of the N-methylated thioureas,
Chem., Ind. 1966, 286. [all data]
Loudon and Webb, 1977
Loudon, A.G.; Webb, K.S.,
The nature of the [C2H6N]+ and [CH4N]+ ions formed by electron impact on methylated formamides, acetamides, ureas, thioureas and hexamethylphosphoramide,
Org. Mass Spectrom., 1977, 12, 283. [all data]