3-Buten-2-ol
- Formula: C4H8O
- Molecular weight: 72.1057
- IUPAC Standard InChIKey: MKUWVMRNQOOSAT-UHFFFAOYSA-N
- CAS Registry Number: 598-32-3
- Chemical structure:
View 3d structure (requires JavaScript / HTML 5) - Other names: Methyl vinylcarbinol; 1-Buten-3-ol; 1-Methyl-2-propenol; 3-Butene-2-ol; 3-Hydroxy-1-butene; CH2=CHCH(OH)CH3; Propenol, 1-methyl; but-3-en-2-ol

Phase change data

Data compiled as indicated in comments:
BS - Robert L. Brown and Stephen E. Stein
TRC - Thermodynamics Research Center, NIST Boulder Laboratories, Chris Muzny director
Quantity | Value | Units | Method | Reference | Comment |
---|---|---|---|---|---|
Tboil | 370.2 | K | N/A | Weast and Grasselli, 1989 | BS |
Tboil | 370.15 | K | N/A | Zeiss and Tsutsui, 1953 | Uncertainty assigned by TRC = 1.5 K; TRC |

Gas phase ion energetics data

Data compiled as indicated in comments:
LBLHLM - Sharon G. Lias, John E. Bartmess, Joel F. Liebman, John L. Holmes, Rhoda D. Levin, and W. Gary Mallard
LLK - Sharon G. Lias, Rhoda D. Levin, and Sherif A. Kafafi
Ionization energy determinations
IE (eV) | Method | Reference | Comment |
---|---|---|---|
9.53 | PI | Traeger and McAdoo, 1986 | LBLHLM |
9.5 | EI | McAdoo and Hudson, 1983 | LBLHLM |
9.50 ± 0.05 | EI | Holmes and Lossing, 1983 | LBLHLM |
10.05 | PE | Vajda and Harrison, 1979 | Vertical value; LLK |
Appearance energy determinations
Ion | AE (eV) | Other Products | Method | Reference | Comment |
---|---|---|---|---|---|
C2H3O+ | 9.82 | C2H5 | PI | Traeger and McAdoo, 1986 | LBLHLM |

Kovats' RI, non-polar column, isothermal

View large format table.

Column type Active phase Temperature (C) I Reference Comment
PackedApiezon L120.542.Bogoslovsky, Anvaer, et al., 1978Celite 545
PackedApiezon L160.543.Bogoslovsky, Anvaer, et al., 1978Celite 545

References

Weast and Grasselli, 1989
CRC Handbook of Data on Organic Compounds, 2nd Editon, Weast,R.C and Grasselli, J.G., ed(s)., CRC Press, Inc., Boca Raton, FL, 1989, 1. [all data]
Zeiss and Tsutsui, 1953
Zeiss, H.H.; Tsutsui, M.,
The Carbon-Oxygen Absorption Band in the Infrared Spectra of Alcohols,
J. Am. Chem. Soc., 1953, 75, 897. [all data]
Traeger and McAdoo, 1986
Traeger, J.C.; McAdoo, D.J.,
Decomposition thresholds and associated translational energy releases for eight C4H8O+ isomers,
Int. J. Mass Spectrom. Ion Processes, 1986, 68, 35. [all data]
McAdoo and Hudson, 1983
McAdoo, D.J.; Hudson, C.E.,
The decompositions of metastable [C4H8O]+ ions and the [C4H8O]+ potential surface,
Org. Mass Spectrom., 1983, 18, 466. [all data]
Holmes and Lossing, 1983
Holmes, J.L.; Lossing, F.P.,
The need for adequate thermochemical data for the interpretation of fragmentation mechanisms and ion structure assignments,
Int. J. Mass Spectrom. Ion Phys., 1983, 47, 133. [all data]
Vajda and Harrison, 1979
Vajda, J.H.; Harrison, A.G.,
Proton affinities of some olefinic carbonyl compounds and heats of formation of CnH2n-1O+ ions,
Int. J. Mass Spectrom. Ion Phys., 1979, 30, 293. [all data]