Bromoacetone
- Formula: C3H5BrO
- Molecular weight: 136.975
- IUPAC Standard InChIKey: VQFAIAKCILWQPZ-UHFFFAOYSA-N
- CAS Registry Number: 598-31-2
- Chemical structure:

Phase change data

Data compiled by: Robert L. Brown and Stephen E. Stein
Reduced pressure boiling point
Tboil (K) | Pressure (atm) | Reference |
---|---|---|
409.7 | 0.954 | Weast and Grasselli, 1989 |

Reaction thermochemistry data

Data compiled by: Hussein Y. Afeefy, Joel F. Liebman, and Stephen E. Stein
Individual Reactions
By formula: HBr + C3H5BrO = C3H6O + Br2
Quantity | Value | Units | Method | Reference | Comment |
---|---|---|---|---|---|
ΔrH° | 7.4 ± 2.0 | kcal/mol | Eqk | King, Golden, et al., 1971 | gas phase; Heat of bromination at 516-618 K |

Gas phase ion energetics data

Data compiled as indicated in comments:
LBLHLM - Sharon G. Lias, John E. Bartmess, Joel F. Liebman, John L. Holmes, Rhoda D. Levin, and W. Gary Mallard
Ionization energy determinations
IE (eV) | Method | Reference | Comment |
---|---|---|---|
9.73 | PE | Olivato, Guerrero, et al., 1984 | LBLHLM |

Gas phase thermochemistry data

Data compiled by: Hussein Y. Afeefy, Joel F. Liebman, and Stephen E. Stein

Quantity Value Units Method Reference Comment
Δfgas-180. ± 8.4kJ/molEqkKing, Golden, et al., 1971Heat of bromination at 516-618 K

References

Weast and Grasselli, 1989
CRC Handbook of Data on Organic Compounds, 2nd Editon, Weast,R.C and Grasselli, J.G., ed(s)., CRC Press, Inc., Boca Raton, FL, 1989, 1. [all data]
King, Golden, et al., 1971
King, K.D.; Golden, D.M.; Benson, S.W.,
Thermochemistry of the gas-phase equilibrium CH3COCH3 + Br2 = CH3COCH2Br + HBr. The enthalpy of formation of bromoacetone,
J. Chem. Thermodyn., 1971, 3, 129-134. [all data]
Olivato, Guerrero, et al., 1984
Olivato, P.R.; Guerrero, S.A.; Modelli, A.; Granozzi, G.; Jones, D.; Distefano, G.,
Electronic interaction in heterosubstituted acetones studied by means of ultraviolet photoelectron and electron transmission spectroscopy,
J. Chem. Soc. Perkin Trans. 2, 1984, 1505. [all data]