Dodecahydrotripyrrolo[1,2-a:1',2'-c:1",2"-e][1,3,5]triazine
- Formula: C12H21N3
- Molecular weight: 207.3152
- IUPAC Standard InChIKey: POPXVWAQMYBXLI-UHFFFAOYSA-N
- CAS Registry Number: 5981-17-9
- Chemical structure:
View 3d structure (requires JavaScript / HTML 5) - Permanent link for this species. Use this link for bookmarking this species for future reference.

Reaction thermochemistry data

Data compiled by: Hussein Y. Afeefy, Joel F. Liebman, and Stephen E. Stein
Individual Reactions
By formula: 3H2 + C12H21N3 = 3C4H9N
Quantity | Value | Units | Method | Reference | Comment |
---|---|---|---|---|---|
ΔrH° | -105. ± 0.4 | kJ/mol | Chyd | Wiberg, Nakaji, et al., 1993 | liquid phase; solvent: Acetic acid |
By formula: 3C4H7N = C12H21N3
Quantity | Value | Units | Method | Reference | Comment |
---|---|---|---|---|---|
ΔrH° | -208. ± 2. | kJ/mol | Eqk | Wiberg, Nakaji, et al., 1993 | liquid phase |

Gas phase ion energetics data

Data compiled by: Sharon G. Lias, John E. Bartmess, Joel F. Liebman, John L. Holmes, Rhoda D. Levin, and W. Gary Mallard
Ionization energy determinations
IE (eV) | Method | Reference | Comment |
---|---|---|---|
7.8 | PE | Beck, Hunig, et al., 1986 | |
8.2 | PE | Beck, Hunig, et al., 1986 | Vertical value |

References

Wiberg, Nakaji, et al., 1993
Wiberg, K.B.; Nakaji, D.Y.; Morgan, K.M.,
Heat of hydrogenation of a cis imine. An experimental and theoretical study,
J. Am. Chem. Soc., 1993, 115, 3527-3532. [all data]
Beck, Hunig, et al., 1986
Beck, K.; Hunig, S.; Poppek, R.; Prokschy, F.; Rademacher, P.,
Photoelektronenspektroscopische untersuchungen an hexahydro-1,3,5-triazinen,
Chem. Ber., 1986, 119, 554. [all data]