1-Propanamine, N,N-dipropyl-, compound with bromine(1:1)
- Formula: C9H21Br2N
- Molecular weight: 303.078
- IUPAC Standard InChIKey: XPOIRFGIXACVRT-UHFFFAOYSA-N
- CAS Registry Number: 59777-82-1
- Chemical structure:
View 3d structure (requires JavaScript / HTML 5) - Permanent link for this species. Use this link for bookmarking this species for future reference.

Gas phase ion energetics data

Data compiled by: Sharon G. Lias, Rhoda D. Levin, and Sherif A. Kafafi
Ionization energy determinations
IE (eV) | Method | Reference | Comment |
---|---|---|---|
10.77 | PE | Utsunomiya, Kobayashi, et al., 1976 | Vertical value |

References

Utsunomiya, Kobayashi, et al., 1976
Utsunomiya, C.; Kobayashi, T.; Nagakura, S.,
Photoelectron spectra of electron donor-acceptor complexes between bromine and alkylamines,
Chem. Phys. Lett., 1976, 39, 245. [all data]