Stannane, tetraethyl-
- Formula: C8H20Sn
- Molecular weight: 234.954
- IUPAC Standard InChIKey: RWWNQEOPUOCKGR-UHFFFAOYSA-N
- CAS Registry Number: 597-64-8
- Chemical structure:
View 3d structure (requires JavaScript / HTML 5) - Other names: Tetraethyltin; Tetraethylstannane; (C2H5)4Sn; Tin, tetraethyl-; TET

Gas phase thermochemistry data

Data compiled by: José A. Martinho Simões
Quantity | Value | Units | Method | Reference | Comment |
---|---|---|---|---|---|
ΔfH°gas | -42.0 ± 2.6 | kJ/mol | Review | Martinho Simões | Selected data. |
ΔfH°gas | -65.4 ± 6.4 | kJ/mol | Review | Martinho Simões | |
ΔfH°gas | -44.0 ± 8.5 | kJ/mol | Review | Martinho Simões | |
ΔfH°gas | -60.8 ± 8.5 | kJ/mol | Review | Martinho Simões | |
ΔfH°gas | -169.5 | kJ/mol | Review | Martinho Simões |

Condensed phase thermochemistry data

Data compiled as indicated in comments:
MS - José A. Martinho Simões
DH - Eugene S. Domalski and Elizabeth D. Hearing
Quantity | Value | Units | Method | Reference | Comment |
---|---|---|---|---|---|
ΔfH°liquid | -92.6 ± 2.6 | kJ/mol | Review | Martinho Simões | Selected data.; MS |
ΔfH°liquid | -116.0 ± 6.4 | kJ/mol | Review | Martinho Simões | MS |
ΔfH°liquid | -94.6 ± 8.5 | kJ/mol | Review | Martinho Simões | MS |
ΔfH°liquid | -111.4 ± 8.5 | kJ/mol | Review | Martinho Simões | MS |
ΔfH°liquid | -220.1 | kJ/mol | Review | Martinho Simões | MS |
Quantity | Value | Units | Method | Reference | Comment |
ΔcH°liquid | -6489.4 ± 8.4 | kJ/mol | CC-SB | Tel'noi and Rabinovich, 1966 | Please also see Cox and Pilcher, 1970.; MS |
ΔcH°liquid | -6491.4 ± 2.3 | kJ/mol | CC-SB | Davies, Pope, et al., 1963 | Please also see Pedley and Rylance, 1977 and Cox and Pilcher, 1970.; MS |
ΔcH°liquid | -6472.6 ± 8.4 | kJ/mol | CC-SB | Dillard, McNeill, et al., 1958 | MS |
ΔcH°liquid | -6468.0 ± 6.3 | kJ/mol | CC-SB | Balandin, Klabunovskii, et al., 1957 | Please also see Cox and Pilcher, 1970.; MS |
ΔcH°liquid | -6363.9 | kJ/mol | CC-SB | Jones, Evans, et al., 1935 | MS |
Constant pressure heat capacity of liquid
Cp,liquid (J/mol*K) | Temperature (K) | Reference | Comment |
---|---|---|---|
301.7 | 298.15 | Maslova, Rabinovich, et al., 1972 | T = 60 to 300 K.; DH |

Phase change data

Data compiled as indicated in comments:
TRC - Thermodynamics Research Center, NIST Boulder Laboratories, Chris Muzny director
MS - José A. Martinho Simões
AC - William E. Acree, Jr., James S. Chickos
DH - Eugene S. Domalski and Elizabeth D. Hearing
Quantity | Value | Units | Method | Reference | Comment |
---|---|---|---|---|---|
Tboil | 473.1 | K | N/A | Dibrivnyi, Dolbneva, et al., 1986 | Uncertainty assigned by TRC = 0.5 K; TRC |
Quantity | Value | Units | Method | Reference | Comment |
Tfus | 142.14 | K | N/A | Staveley, Warren, et al., 1954 | Uncertainty assigned by TRC = 0.2 K; TRC |
Quantity | Value | Units | Method | Reference | Comment |
Ttriple | 141.9 | K | N/A | Maslova, Rabinovich, et al., 1972, 2 | Crystal phase 1 phase; Uncertainty assigned by TRC = 0.2 K; TRC |
Quantity | Value | Units | Method | Reference | Comment |
ΔvapH° | 50.6 ± 0.2 | kJ/mol | CC-SB | Abraham and Irving, 1980 | Another value for the enthalpy of vaporization has been reported: 51.0 ± 2.1 kJ/mol Davies, Pope, et al., 1963.; MS |
ΔvapH° | 50.6 ± 0.2 | kJ/mol | C | Abraham and Irving, 1980, 2 | AC |
Enthalpy of vaporization
ΔvapH (kJ/mol) | Temperature (K) | Method | Reference | Comment |
---|---|---|---|---|
46.6 ± 0.6 | 374. | N/A | Baev, 2001 | Based on data from 293. to 455. K.; AC |
42.4 | 313. to 393. | GC | Hawker, 1992 | AC |
Enthalpy of fusion
ΔfusH (kJ/mol) | Temperature (K) | Reference | Comment |
---|---|---|---|
9.146 | 142.14 | Staveley, Warren, et al., 1954, 2 | DH |
9.15 | 142.1 | Domalski and Hearing, 1996 | AC |
Entropy of fusion
ΔfusS (J/mol*K) | Temperature (K) | Reference | Comment |
---|---|---|---|
64.35 | 142.14 | Staveley, Warren, et al., 1954, 2 | DH |
Enthalpy of phase transition
ΔHtrs (kJ/mol) | Temperature (K) | Initial Phase | Final Phase | Reference | Comment |
---|---|---|---|---|---|
-1.090 | 121.4 | crystaline, II | crystaline, I | Maslova, Rabinovich, et al., 1972 | Metastable transition.; DH |
8.929 | 141.9 | crystaline, I | liquid | Maslova, Rabinovich, et al., 1972 | DH |
Entropy of phase transition
ΔStrs (J/mol*K) | Temperature (K) | Initial Phase | Final Phase | Reference | Comment |
---|---|---|---|---|---|
62.9 | 141.9 | crystaline, I | liquid | Maslova, Rabinovich, et al., 1972 | DH |

Reaction thermochemistry data

Data compiled by: José A. Martinho Simões
Individual Reactions
(l) +
(l) = C2H5Cl3Sn (l) +
(l)
By formula: C8H20Sn (l) + Cl4Sn (l) = C2H5Cl3Sn (l) + C6H15ClSn (l)
Quantity | Value | Units | Method | Reference | Comment |
---|---|---|---|---|---|
ΔrH° | -94.6 ± 4.6 | kJ/mol | RSC and EST | Nash, Skinner, et al., 1965 |
By formula: 3C8H20Sn (l) + Cl4Sn (l) = 4C6H15ClSn (l)
Quantity | Value | Units | Method | Reference | Comment |
---|---|---|---|---|---|
ΔrH° | -189.5 ± 9.2 | kJ/mol | RSC and EST | Nash, Skinner, et al., 1965 |

Gas phase ion energetics data

Data compiled as indicated in comments:
LLK - Sharon G. Lias, Rhoda D. Levin, and Sherif A. Kafafi
RDSH - Henry M. Rosenstock, Keith Draxl, Bruce W. Steiner, and John T. Herron
Ionization energy determinations
IE (eV) | Method | Reference | Comment |
---|---|---|---|
10.3 | EI | deRidder and Dijkstra, 1967 | RDSH |
8.93 | PE | Kochi, 1980 | Vertical value; LLK |
9.0 | PE | Beltram, Fehlner, et al., 1980 | Vertical value; LLK |
8.87 | PE | Hosomi and Traylor, 1975 | Vertical value; LLK |
Appearance energy determinations
Ion | AE (eV) | Other Products | Method | Reference | Comment |
---|---|---|---|---|---|
C2H5Sn+ | 14.4 | ? | EI | deRidder and Dijkstra, 1967 | RDSH |
C2H7Sn+ | 13.0 | ? | EI | deRidder and Dijkstra, 1967 | RDSH |
C4H11Sn+ | 12.1 | ? | EI | deRidder and Dijkstra, 1967 | RDSH |
C6H15Sn+ | 8.70 ± 0.09 | ? | EI | Chambers and Glockling, 1970 | RDSH |
C6H15Sn+ | 10.9 | ? | EI | deRidder and Dijkstra, 1967 | RDSH |
SnH+ | 16.7 | ? | EI | deRidder and Dijkstra, 1967 | RDSH |
Sn+ | 17.1 | ? | EI | deRidder and Dijkstra, 1967 | RDSH |

Van Den Dool and Kratz RI, non-polar column, temperature ramp

Data compiled by: NIST Mass Spectrometry Data Center, William E. Wallace, director

Column type PackedPackedPacked
Active phase Apiezon LApiezon LApiezon L
Column length (m) 3.3.3.
Carrier gas
Substrate CeliteCeliteCelite
Column diameter (mm)
Phase thickness (μm)
Tstart (C) 60.60.60.
Tend (C)
Heat rate (K/min) 10.15.6.
Initial hold (min)
Final hold (min)
I 1037.1038.1039.
ReferencePutnam and Pu, 1965Putnam and Pu, 1965Putnam and Pu, 1965
Comment MSDC-RI MSDC-RI MSDC-RI

References

Martinho Simões
Martinho Simões, J.A.,
Private communication (see http://webbook.nist.gov/chemistry/om/). [all data]
Tel'noi and Rabinovich, 1966
Tel'noi, V.I.; Rabinovich, I.B.,
Russ. J. Phys. Chem., 1966, 40, 842. [all data]
Cox and Pilcher, 1970
Cox, J.D.; Pilcher, G.,
Thermochemistry of Organic and Organometallic Compounds
in Academic Press, New York, 1970. [all data]
Davies, Pope, et al., 1963
Davies, J.V.; Pope, A.E.; Skinner, H.A.,
Thermochemistry of metallic alkyls. Part 10.?Heats of combustion of some tetra-alkyls of tin,
Trans. Faraday Soc., 1963, 59, 2233, https://doi.org/10.1039/tf9635902233
. [all data]
Pedley and Rylance, 1977
Pedley, J.B.; Rylance, J.,
Computer Analysed Thermochemical Data: Organic and Organometallic Compounds, University of Sussex, Brigton, 1977. [all data]
Dillard, McNeill, et al., 1958
Dillard, C.R.; McNeill, E.H.; Simmons, D.E.; Yeldell, J.B.,
J. Am. Chem. Soc., 1958, 80, 3607. [all data]
Balandin, Klabunovskii, et al., 1957
Balandin, A.A.; Klabunovskii, E.I.; Kozina, M.P.; Ul'yanova, O.D.,
Izvest. Akad. Nauk SSSR Otdel. Khim. Nauk, 1957. [all data]
Jones, Evans, et al., 1935
Jones, W.J.; Evans, D.P.; Gulwell, T.; Griffiths, D.C.,
J. Chem. Soc., 1935, 39.. [all data]
Maslova, Rabinovich, et al., 1972
Maslova, V.A.; Rabinovich, I.B.; Nistoalov, V.P.; Faminskaya, L.A.,
Specific heat and phase transitions of some alkyl compounds of silicon, germanium, and tin,
Tr. Khim. Khim. Tekhnol., 1972, (2), 44-50. [all data]
Dibrivnyi, Dolbneva, et al., 1986
Dibrivnyi, V.N.; Dolbneva, T.N.; Dikii, M.A.,
Saturated vapor pressure and vaporization enthalpies of aromatic peroxides
in Vses. Konf. po Kalorimetrii i Khim. Termodinamike, 11th, Novosibirsk, Nr 2, p 115, 1986. [all data]
Staveley, Warren, et al., 1954
Staveley, L.A.K.; Warren, J.B.; Paget, H.P.; Dowrick, D.J.,
Some Thermodynamic Properties of Compounds of the Formula MX4 II. Tetraalkyl Compounds,
J. Chem. Soc., 1954, 1954, 1992. [all data]
Maslova, Rabinovich, et al., 1972, 2
Maslova, V.A.; Rabinovich, I.B.; Nistoalov, V.P.; Faminskaya, L.A.,
Specific heat and phase transition of some alkyl compounds of silicon, germanium, and tin,
Tr. Khim. Khim. Tekhnol., 1972, 1972, 44. [all data]
Abraham and Irving, 1980
Abraham, M.H.; Irving, R.J.,
J. Chem. Thermodyn., 1980, 12, 539. [all data]
Abraham and Irving, 1980, 2
Abraham, M.H.; Irving, R.J.,
Enthalpies of vaporization of tetramethyltin, tetraethyltin, tetra-n-propyltin, and tetraethyl-lead, and a survey of the Group IV tetramethyl and tetraethyl compounds,
The Journal of Chemical Thermodynamics, 1980, 12, 6, 539-544, https://doi.org/10.1016/0021-9614(80)90183-4
. [all data]
Baev, 2001
Baev, A.K.,
Izv. Vyssh. Uchebn. Zaved., Khim. Khim. Tekhnol., 2001, 44, 1, 3. [all data]
Hawker, 1992
Hawker, Darryl,
Equilibrium vapour pressures of tetraorganostannanes,
Chemosphere, 1992, 25, 4, 427-436, https://doi.org/10.1016/0045-6535(92)90276-W
. [all data]
Staveley, Warren, et al., 1954, 2
Staveley, L.A.K.; Warren, J.B.; Paget, H.P.; Dowrick, D.J.,
Some thermodynamic properties of compounds of the formula MX4. Part II. Tetra-alkyl compounds, 1954, J. [all data]
Domalski and Hearing, 1996
Domalski, Eugene S.; Hearing, Elizabeth D.,
Heat Capacities and Entropies of Organic Compounds in the Condensed Phase. Volume III,
J. Phys. Chem. Ref. Data, 1996, 25, 1, 1, https://doi.org/10.1063/1.555985
. [all data]
Nash, Skinner, et al., 1965
Nash, G.A.; Skinner, H.A.; Stack, W.F.,
Trans. Faraday Soc., 1965, 61, 640. [all data]
deRidder and Dijkstra, 1967
deRidder, J.J.; Dijkstra, G.,
Mass spectra of the tetramethyl and tetraethyl compounds of carbon, silicon, germanium, tin and lead,
Rec. Trav. Chim., 1967, 86, 737. [all data]
Kochi, 1980
Kochi, J.K.,
The role of electron transfer and charge transfer in organometallic chemistry,
Pure Appl. Chem., 1980, 52, 571. [all data]
Beltram, Fehlner, et al., 1980
Beltram, G.; Fehlner, T.P.; Mochida, K.; Kochi, J.K.,
UV photoelectron spectra of group IV alkyl hydrides,
J. Electron Spectrosc. Relat. Phenom., 1980, 18, 153. [all data]
Hosomi and Traylor, 1975
Hosomi, A.; Traylor, T.G.,
Studies of interactions of adjacent carbon-metal σ bonds by photoelectron spectroscopy,
J. Am. Chem. Soc., 1975, 97, 3682. [all data]
Chambers and Glockling, 1970
Chambers, D.B.; Glockling, F.,
Electron impact determination of heats of formation and bond energies in triphenyltin compounds,
Inorg. Chim. Acta, 1970, 4, 150. [all data]