Plumbane, tetraphenyl-
- Formula: C24H20Pb
- Molecular weight: 515.6
- IUPAC Standard InChIKey: WBJSMHDYLOJVKC-UHFFFAOYSA-N
- CAS Registry Number: 595-89-1
- Chemical structure:

Gas phase thermochemistry data

Data compiled by: José A. Martinho Simões
Quantity | Value | Units | Method | Reference | Comment |
---|---|---|---|---|---|
ΔfH°gas | 161.1 ± 3.7 | kcal/mol | Review | Martinho Simões | Selected data |

Condensed phase thermochemistry data

Data compiled by: José A. Martinho Simões
Quantity | Value | Units | Method | Reference | Comment |
---|---|---|---|---|---|
ΔfH°solid | 123.1 ± 3.7 | kcal/mol | Review | Martinho Simões | Selected data |
Quantity | Value | Units | Method | Reference | Comment |
ΔcH°solid | -3115.6 ± 3.6 | kcal/mol | CC-RB | Carson, Laye, et al., 1972 | Please also see Pedley and Rylance, 1977. |

Gas phase ion energetics data

Data compiled as indicated in comments:
LBLHLM - Sharon G. Lias, John E. Bartmess, Joel F. Liebman, John L. Holmes, Rhoda D. Levin, and W. Gary Mallard
Ionization energy determinations
IE (eV) | Method | Reference | Comment |
---|---|---|---|
8.0 | PE | Novak and Potts, 1984 | LBLHLM |
8.95 | PE | Novak and Potts, 1984 | Vertical value; LBLHLM |

References

Martinho Simões
Martinho Simões, J.A.,
Private communication (see http://webbook.nist.gov/chemistry/om/). [all data]
Carson, Laye, et al., 1972
Carson, A.S.; Laye, P.G.; Spencer, J.A.; Steele, W.V.,
J. Chem. Thermodyn., 1972, 4, 783. [all data]
Pedley and Rylance, 1977
Pedley, J.B.; Rylance, J.,
Computer Analysed Thermochemical Data: Organic and Organometallic Compounds, University of Sussex, Brigton, 1977. [all data]
Novak and Potts, 1984
Novak, I.; Potts, A.W.,
The UV gas-phase photoelectron spectra of Group IVB tetraphenyl derivatives,
J. Organomet. Chem., 1984, 262, 17. [all data]