Thiirane, ethenyl-
- Formula: C4H6S
- Molecular weight: 86.155
- IUPAC Standard InChIKey: JNUIIZUUNVYHCS-UHFFFAOYSA-N
- CAS Registry Number: 5954-75-6
- Chemical structure:
View 3d structure (requires JavaScript / HTML 5) - Other names: 1-Butene, 3,4-epithio-; Vinylthiiran; Vinylthiirane; 3,4-Epithio-1-butene

Phase change data

Data compiled by: William E. Acree, Jr., James S. Chickos
Enthalpy of vaporization
ΔvapH (kJ/mol) | Temperature (K) | Method | Reference | Comment |
---|---|---|---|---|
38.7 | 288. | A | Stephenson and Malanowski, 1987 | Based on data from 273. to 335. K. See also Dykyj, Svoboda, et al., 1999. |

Gas phase ion energetics data

Data compiled by: Sharon G. Lias, Rhoda D. Levin, and Sherif A. Kafafi
Ionization energy determinations
IE (eV) | Method | Reference | Comment |
---|---|---|---|
8.89 | PE | McAlduff and Houk, 1977 | Vertical value |

References

Stephenson and Malanowski, 1987
Stephenson, Richard M.; Malanowski, Stanislaw,
Handbook of the Thermodynamics of Organic Compounds, 1987, https://doi.org/10.1007/978-94-009-3173-2
. [all data]
Dykyj, Svoboda, et al., 1999
Dykyj, J.; Svoboda, J.; Wilhoit, R.C.; Frenkel, M.L.; Hall, K.R.,
Vapor Pressure of Chemicals: Part A. Vapor Pressure and Antoine Constants for Hydrocarbons and Sulfur, Selenium, Tellurium and Hydrogen Containing Organic Compounds, Springer, Berlin, 1999, 373. [all data]
McAlduff and Houk, 1977
McAlduff, E.J.; Houk, K.N.,
Photoelectron spectra of substituted oxiranes and thiiranes. Substituent effects on ionization potentials involving σ orbitals,
Can. J. Chem., 1977, 55, 318. [all data]