2-Butanone, 3-chloro-3-methyl-
- Formula: C5H9ClO
- Molecular weight: 120.577
- IUPAC Standard InChIKey: FTJRNNIDCLELRD-UHFFFAOYSA-N
- CAS Registry Number: 5950-19-6
- Chemical structure:
View 3d structure (requires JavaScript / HTML 5) - Species with the same structure:

Gas phase ion energetics data

Data compiled by: Sharon G. Lias, John E. Bartmess, Joel F. Liebman, John L. Holmes, Rhoda D. Levin, and W. Gary Mallard
Ionization energy determinations
IE (eV) | Method | Reference |
---|---|---|
9.7 | EI | Dommrose and Grutzmacher, 1987 |

Normal alkane RI, non-polar column, temperature ramp

Column type | Active phase | I | Reference | Comment |
---|---|---|---|---|
Capillary | OV-101 | 763. | Zenkevich, 2005 | 25. m/0.20 mm/0.10 μm, N2/He, 6. K/min; Tstart: 50. C; Tend: 250. C |

References

Dommrose and Grutzmacher, 1987
Dommrose, A.; Grutzmacher, H.,
Destablized carbenium ions: A-acetyl-a,a-dimethylmethyl cations,
Int. J. Mass Spectrom. Ion Processes, 1987, 76, 95. [all data]
Zenkevich, 2005
Zenkevich, I.G.,
Experimentally measured retention indices., 2005. [all data]