Acetamide, 2,2,2-trichloro-
- Formula: C2H2Cl3NO
- Molecular weight: 162.402
- IUPAC Standard InChIKey: UPQQXPKAYZYUKO-UHFFFAOYSA-N
- CAS Registry Number: 594-65-0
- Chemical structure:

Condensed phase thermochemistry data

Data compiled by: Hussein Y. Afeefy, Joel F. Liebman, and Stephen E. Stein
Quantity | Value | Units | Method | Reference | Comment |
---|---|---|---|---|---|
ΔcH°liquid | -3143. ± 33. | kJ/mol | Ccb | Smith, Bjellerup, et al., 1953 | Reanalyzed by Cox and Pilcher, 1970, Original value = -3150. ± 20. kJ/mol; At 291.7 °K |
Quantity | Value | Units | Method | Reference | Comment |
ΔcH°solid | -779.1 | kJ/mol | Ccb | Schjanberg, 1935 |

Phase change data

Data compiled by: Robert L. Brown and Stephen E. Stein
Quantity | Value | Units | Method | Reference | Comment |
---|---|---|---|---|---|
Tboil | 512.2 | K | N/A | Aldrich Chemical Company Inc., 1990 |

Gas phase ion energetics data

Data compiled as indicated in comments:
B - John E. Bartmess
LLK - Sharon G. Lias, Rhoda D. Levin, and Sherif A. Kafafi
Ionization energy determinations
IE (eV) | Method | Reference | Comment |
---|---|---|---|
10.53 | PE | Overman, Taylor, et al., 1978 | Vertical value; LLK |
De-protonation reactions
C2HCl3NO- + =
By formula: C2HCl3NO- + H+ = C2H2Cl3NO
Quantity | Value | Units | Method | Reference | Comment |
---|---|---|---|---|---|
ΔrH° | 1436. ± 8.8 | kJ/mol | G+TS | Taft, 1987 | gas phase; value altered from reference due to change in acidity scale; B |
Quantity | Value | Units | Method | Reference | Comment |
ΔrG° | 1406. ± 8.4 | kJ/mol | IMRE | Taft, 1987 | gas phase; value altered from reference due to change in acidity scale; B |

Reaction thermochemistry data

Data compiled by: John E. Bartmess
Individual Reactions
C2HCl3NO- + =
By formula: C2HCl3NO- + H+ = C2H2Cl3NO
Quantity | Value | Units | Method | Reference | Comment |
---|---|---|---|---|---|
ΔrH° | 343.1 ± 2.1 | kcal/mol | G+TS | Taft, 1987 | gas phase; value altered from reference due to change in acidity scale |
Quantity | Value | Units | Method | Reference | Comment |
ΔrG° | 336.1 ± 2.0 | kcal/mol | IMRE | Taft, 1987 | gas phase; value altered from reference due to change in acidity scale |

References

Smith, Bjellerup, et al., 1953
Smith, L.; Bjellerup, L.; Krook, S.; Westermark, H.,
Heats of combustion of organic chloro compounds determined by the "quartz wool" method,
Acta Chem. Scand., 1953, 7, 65. [all data]
Cox and Pilcher, 1970
Cox, J.D.; Pilcher, G.,
Thermochemistry of Organic and Organometallic Compounds, Academic Press, New York, 1970, 1-636. [all data]
Schjanberg, 1935
Schjanberg, E.,
Die Verbrennungswarmen und die Refraktionsdaten einiger chlorsubstituierter Fettsauren und Ester.,
Z. Phys. Chem. Abt. A, 1935, 172, 197-233. [all data]
Aldrich Chemical Company Inc., 1990
Aldrich Chemical Company Inc.,
Catalog Handbook of Fine Chemicals, Aldrich Chemical Company, Inc., Milwaukee WI, 1990, 1. [all data]
Overman, Taylor, et al., 1978
Overman, L.E.; Taylor, G.F.; Houk, K.N.; Domelsmith, L.N.,
Diels-Alder reactions between trans-1-N-acylamino-1,3-dienes and methyl acrylate. A correlation between diene photoelectron ionization potentials and reactivity, stereoselectivity, and regioselectivity,
J. Am. Chem. Soc., 1978, 100, 3182. [all data]
Taft, 1987
Taft, R.W.,
The Nature and Analysis of Substitutent Electronic Effects,
Personal communication. See also Prog. Phys. Org. Chem., 1987, 16, 1. [all data]