Thiophene, 2,5-dinitro-
- Formula: C4H2N2O4S
- Molecular weight: 174.135
- IUPAC Standard InChIKey: OIGLJQJSZJIDSO-UHFFFAOYSA-N
- CAS Registry Number: 59434-05-8
- Chemical structure:
View 3d structure (requires JavaScript / HTML 5) - Permanent link for this species. Use this link for bookmarking this species for future reference.

Phase change data

Data compiled by: William E. Acree, Jr., James S. Chickos
Enthalpy of vaporization
ΔvapH (kJ/mol) | Temperature (K) | Reference | Comment |
---|---|---|---|
59.6 | 403. | Dykyj, Svoboda, et al., 1999 | Based on data from 388. to 523. K. |

Gas phase ion energetics data

Data compiled by: Sharon G. Lias, John E. Bartmess, Joel F. Liebman, John L. Holmes, Rhoda D. Levin, and W. Gary Mallard
Ionization energy determinations
IE (eV) | Method | Reference | Comment |
---|---|---|---|
10.16 | PE | Bajic, Humski, et al., 1985 | |
10.37 | PE | Bajic, Humski, et al., 1985 | Vertical value |

References

Dykyj, Svoboda, et al., 1999
Dykyj, J.; Svoboda, J.; Wilhoit, R.C.; Frenkel, M.L.; Hall, K.R.,
Vapor Pressure of Chemicals: Part A. Vapor Pressure and Antoine Constants for Hydrocarbons and Sulfur, Selenium, Tellurium and Hydrogen Containing Organic Compounds, Springer, Berlin, 1999, 373. [all data]
Bajic, Humski, et al., 1985
Bajic, M.; Humski, K.; Klasinc, L.; Ruscic, B.,
Substitution effects on electronic structure of thiophene,
Z. Naturforsch. B:, 1985, 40, 1214. [all data]