Stibine, trimethyl-
- Formula: C3H9Sb
- Molecular weight: 166.864
- IUPAC Standard InChIKey: PORFVJURJXKREL-UHFFFAOYSA-N
- CAS Registry Number: 594-10-5
- Chemical structure:

Condensed phase thermochemistry data

Data compiled by: José A. Martinho Simões
Quantity | Value | Units | Method | Reference | Comment |
---|---|---|---|---|---|
ΔfH°liquid | 1. ± 25. | kJ/mol | Review | Martinho Simões | |
Quantity | Value | Units | Method | Reference | Comment |
ΔcH°liquid | -2921. ± 25. | kJ/mol | CC-SB | Long and Sackman, 1955 | Please also see Pedley and Rylance, 1977 and Cox and Pilcher, 1970. |

Phase change data

Data compiled as indicated in comments:
AC - William E. Acree, Jr., James S. Chickos
MS - José A. Martinho Simões
Quantity | Value | Units | Method | Reference | Comment |
---|---|---|---|---|---|
ΔvapH° | 32.5 ± 0.01 | kJ/mol | N/A | Fulem, Moravek, et al., 2010 | Based on data from 249. to 296. K.; AC |
ΔvapH° | 31.4 ± 1.3 | kJ/mol | CC-SB | Bamford, Levi, et al., 1946 | Please also see Long and Sackman, 1955, 2.; MS |

Gas phase ion energetics data

Data compiled as indicated in comments:
LBLHLM - Sharon G. Lias, John E. Bartmess, Joel F. Liebman, John L. Holmes, Rhoda D. Levin, and W. Gary Mallard
LLK - Sharon G. Lias, Rhoda D. Levin, and Sherif A. Kafafi
RDSH - Henry M. Rosenstock, Keith Draxl, Bruce W. Steiner, and John T. Herron
Ionization energy determinations
IE (eV) | Method | Reference | Comment |
---|---|---|---|
7.7 | PE | Elbel, Dieck, et al., 1982 | LBLHLM |
8.04 ± 0.16 | EI | Winters and Kiser, 1967 | RDSH |
8.48 | PE | Elbel, Dieck, et al., 1982 | Vertical value; LBLHLM |
8.48 | PE | Elbel, Bergmann, et al., 1974 | Vertical value; LLK |
Appearance energy determinations
Ion | AE (eV) | Other Products | Method | Reference | Comment |
---|---|---|---|---|---|
CHSb+ | 13.7 ± 0.4 | ? | EI | Winters and Kiser, 1967 | RDSH |
CH2Sb+ | 15.1 ± 0.2 | ? | EI | Winters and Kiser, 1967 | RDSH |
CH3Sb+ | 14.3 ± 0.2 | ? | EI | Winters and Kiser, 1967 | RDSH |
CH4Sb+ | 13.4 ± 0.3 | ? | EI | Winters and Kiser, 1967 | RDSH |
C2H4Sb+ | 12.6 ± 0.3 | ? | EI | Winters and Kiser, 1967 | RDSH |
C2H6Sb+ | 10.5 ± 0.2 | CH3 | EI | Winters and Kiser, 1967 | RDSH |
SbH+ | 14.5 ± 0.5 | ? | EI | Winters and Kiser, 1967 | RDSH |
SbH2+ | 13.7 ± 0.2 | ? | EI | Winters and Kiser, 1967 | RDSH |
Sb+ | 14.8 ± 0.4 | ? | EI | Winters and Kiser, 1967 | RDSH |

Gas phase thermochemistry data

Data compiled by: José A. Martinho Simões
Quantity | Value | Units | Method | Reference | Comment |
---|---|---|---|---|---|
ΔfH°gas | 32. ± 25. | kJ/mol | Review | Martinho Simões |

References

Martinho Simões
Martinho Simões, J.A.,
Private communication (see http://webbook.nist.gov/chemistry/om/). [all data]
Long and Sackman, 1955
Long, L.H.; Sackman, J.F.,
The heat of formation of antimony trimethyl,
Trans. Faraday Soc., 1955, 51, 1062, https://doi.org/10.1039/tf9555101062
. [all data]
Pedley and Rylance, 1977
Pedley, J.B.; Rylance, J.,
Computer Analysed Thermochemical Data: Organic and Organometallic Compounds, University of Sussex, Brigton, 1977. [all data]
Cox and Pilcher, 1970
Cox, J.D.; Pilcher, G.,
Thermochemistry of Organic and Organometallic Compounds
in Academic Press, New York, 1970. [all data]
Fulem, Moravek, et al., 2010
Fulem, Michal; Moravek, Pavel; Pangrac, Jiri; Hulicius, Eduard; Simecek, Tomislav; Ruzicka, Kvetoslav; Ruzicka, Vlastimil; Kozyrkin, Boris; Shatunov, Valery,
Vapor Pressure of Trimethylantimony and tert -Butyldimethylantimony,
J. Chem. Eng. Data, 2010, 55, 1, 362-365, https://doi.org/10.1021/je900372v
. [all data]
Bamford, Levi, et al., 1946
Bamford, C.H.; Levi, D.L.; Newitt, D.M.,
J. Chem. Soc., 1946, 468.. [all data]
Long and Sackman, 1955, 2
Long, L.H.; Sackman, J.F.,
Research (Correspondence), 1955, 8, 523. [all data]
Elbel, Dieck, et al., 1982
Elbel, S.; Dieck, H.T.; Demuth, R.,
Photoelectron sSpectra of group V compounds. IX. The relative perfluoroalkyl substituent effect,
J. Fluorine Chem., 1982, 19, 349. [all data]
Winters and Kiser, 1967
Winters, R.E.; Kiser, R.W.,
Ionization and fragmentation of dimethylzinc, trimethylaluminum, and trimethylantimony,
J. Organometal. Chem., 1967, 10, 7. [all data]
Elbel, Bergmann, et al., 1974
Elbel, S.; Bergmann, H.; EnBlin, W.,
Photoelectron spectra of the trimethyl compounds of the Group V elements,
J. Chem. Soc. Faraday Trans. 2., 1974, 70, 555. [all data]