Trimethylphosphine
- Formula: C3H9P
- Molecular weight: 76.0773
- IUPAC Standard InChIKey: YWWDBCBWQNCYNR-UHFFFAOYSA-N
- CAS Registry Number: 594-09-2
- Chemical structure:
View 3d structure (requires JavaScript / HTML 5) - Other names: Phosphine, trimethyl-; Trimethylphosphorus; (CH3)3P

Phase change data

Data compiled by: William E. Acree, Jr., James S. Chickos
Enthalpy of vaporization
ΔvapH (kJ/mol) | Temperature (K) | Method | Reference | Comment |
---|---|---|---|---|
28.9 | 263. | A | Stephenson and Malanowski, 1987 | Based on data from 248. to 310. K. |

Reaction thermochemistry data

Data compiled by: John E. Bartmess
Individual Reactions
C3H8P- + =
By formula: C3H8P- + H+ = C3H9P
Quantity | Value | Units | Method | Reference | Comment |
---|---|---|---|---|---|
ΔrH° | 1636. ± 8.8 | kJ/mol | G+TS | Ingemann and Nibbering, 1985 | gas phase |
ΔrH° | 1612. ± 17. | kJ/mol | G+TS | Romer, Gatev, et al., 1998 | gas phase; The conflict with Ingemann and Nibbering, 1985, 22 is not resolved |
ΔrH° | 1607. ± 13. | kJ/mol | G+TS | Grabowski, Roy, et al., 1988 | gas phase; Between O-. and MeO-, nearer the latter. |
Quantity | Value | Units | Method | Reference | Comment |
ΔrG° | 1606. ± 8.4 | kJ/mol | IMRE | Ingemann and Nibbering, 1985 | gas phase |
ΔrG° | 1582. ± 17. | kJ/mol | IMRB | Romer, Gatev, et al., 1998 | gas phase; The conflict with Ingemann and Nibbering, 1985, 22 is not resolved |
ΔrG° | 1577. ± 13. | kJ/mol | IMRB | Grabowski, Roy, et al., 1988 | gas phase; Between O-. and MeO-, nearer the latter. |

Gas phase ion energetics data

Data evaluated as indicated in comments:
HL - Edward P. Hunter and Sharon G. Lias
Data compiled as indicated in comments:
B - John E. Bartmess
LBLHLM - Sharon G. Lias, John E. Bartmess, Joel F. Liebman, John L. Holmes, Rhoda D. Levin, and W. Gary Mallard
LLK - Sharon G. Lias, Rhoda D. Levin, and Sherif A. Kafafi
RDSH - Henry M. Rosenstock, Keith Draxl, Bruce W. Steiner, and John T. Herron
Quantity | Value | Units | Method | Reference | Comment |
---|---|---|---|---|---|
Proton affinity (review) | 958.8 | kJ/mol | N/A | Hunter and Lias, 1998 | HL |
Quantity | Value | Units | Method | Reference | Comment |
Gas basicity | 926.3 | kJ/mol | N/A | Hunter and Lias, 1998 | HL |
Ionization energy determinations
IE (eV) | Method | Reference | Comment |
---|---|---|---|
8.12 | PE | Bancroft, Chan, et al., 1982 | LBLHLM |
8.11 | PE | Hodges, McDonnell, et al., 1980 | LLK |
8.1 ± 0.1 | PE | Hodges, Houle, et al., 1980 | LLK |
8.79 | PE | Yarbrough and Hall, 1978 | LLK |
8.01 ± 0.07 | PE | Staley and Beauchamp, 1974 | LLK |
8.6 ± 0.2 | EI | Wada and Kiser, 1964 | RDSH |
9.2 ± 0.5 | EI | Fischler and Halmann, 1964 | RDSH |
8.62 ± 0.05 | PE | Ikuta, Kebarle, et al., 1982 | Vertical value; LBLHLM |
8.60 | PE | Elbel, Dieck, et al., 1982 | Vertical value; LBLHLM |
8.60 | PE | Cowley, Kemp, et al., 1982 | Vertical value; LBLHLM |
8.62 | PE | Bancroft, Chan, et al., 1982 | Vertical value; LBLHLM |
8.60 | PE | Starzewski, Richter, et al., 1976 | Vertical value; LLK |
8.60 | PE | Starzewski and Bock, 1976 | Vertical value; LLK |
8.65 | PE | Lappert, Pedley, et al., 1975 | Vertical value; LLK |
8.60 | PE | Elbel, Bergmann, et al., 1974 | Vertical value; LLK |
8.6 | PE | Schafer and Schweig, 1972 | Vertical value; LLK |
8.6 ± 0.1 | PE | Cradock, Ebsworth, et al., 1972 | Vertical value; LLK |
Appearance energy determinations
Ion | AE (eV) | Other Products | Method | Reference | Comment |
---|---|---|---|---|---|
CHP+ | 18.4 ± 0.2 | ? | EI | Wada and Kiser, 1964 | RDSH |
CH2P+ | 16.1 ± 0.4 | ? | EI | Wada and Kiser, 1964 | RDSH |
CH2P+ | 17. ± 1. | ? | EI | Fischler and Halmann, 1964 | RDSH |
CH3+ | 21.7 ± 0.5 | ? | EI | Fischler and Halmann, 1964 | RDSH |
CH3P+ | 14.0 ± 0.3 | ? | EI | Wada and Kiser, 1964 | RDSH |
CH4P+ | 14.7 ± 0.2 | ? | EI | Wada and Kiser, 1964 | RDSH |
PC+ | 13.2 ± 0.3 | ? | EI | Wada and Kiser, 1964 | RDSH |
C2H4P+ | 14.0 ± 0.2 | ? | EI | Wada and Kiser, 1964 | RDSH |
C2H4P+ | 15. ± 1. | ? | EI | Fischler and Halmann, 1964 | RDSH |
C2H6P+ | 11.7 ± 0.2 | CH3 | EI | Wada and Kiser, 1964 | RDSH |
C2H6P+ | 11.8 ± 0.2 | CH3 | EI | Fischler and Halmann, 1964 | RDSH |
C3H8P+ | 11.0 ± 0.1 | H | EI | Taft, Martin, et al., 1965 | RDSH |
C3H8P+ | 10.2 ± 0.5 | H | EI | Wada and Kiser, 1964 | RDSH |
C3H8P+ | 11.8 ± 0.2 | H | EI | Fischler and Halmann, 1964 | RDSH |
PH4+ | 14.2 ± 0.2 | ? | EI | Wada and Kiser, 1964 | RDSH |
De-protonation reactions
C3H8P- + =
By formula: C3H8P- + H+ = C3H9P
Quantity | Value | Units | Method | Reference | Comment |
---|---|---|---|---|---|
ΔrH° | 1636. ± 8.8 | kJ/mol | G+TS | Ingemann and Nibbering, 1985 | gas phase; B |
ΔrH° | 1612. ± 17. | kJ/mol | G+TS | Romer, Gatev, et al., 1998 | gas phase; The conflict with Ingemann and Nibbering, 1985, 22 is not resolved; B |
ΔrH° | 1607. ± 13. | kJ/mol | G+TS | Grabowski, Roy, et al., 1988 | gas phase; Between O-. and MeO-, nearer the latter.; B |
Quantity | Value | Units | Method | Reference | Comment |
ΔrG° | 1606. ± 8.4 | kJ/mol | IMRE | Ingemann and Nibbering, 1985 | gas phase; B |
ΔrG° | 1582. ± 17. | kJ/mol | IMRB | Romer, Gatev, et al., 1998 | gas phase; The conflict with Ingemann and Nibbering, 1985, 22 is not resolved; B |
ΔrG° | 1577. ± 13. | kJ/mol | IMRB | Grabowski, Roy, et al., 1988 | gas phase; Between O-. and MeO-, nearer the latter.; B |

References

Stephenson and Malanowski, 1987
Stephenson, Richard M.; Malanowski, Stanislaw,
Handbook of the Thermodynamics of Organic Compounds, 1987, https://doi.org/10.1007/978-94-009-3173-2
. [all data]
Ingemann and Nibbering, 1985
Ingemann, S.; Nibbering, N.M.M.,
Gas-phase acidity of CH3X [X = P(CH3)2, SCH3, F, Cl, Br, I] compounds,
J. Chem. Soc. Perkin Trans. 2, 1985, 837. [all data]
Romer, Gatev, et al., 1998
Romer, B.; Gatev, G.G.; Zhong, M.; Brauman, J.I.,
Alpha-Stabilization by Silyl and Phosphino Substitution,
J. Am. Chem. Soc., 1998, 120, 12, 2919, https://doi.org/10.1021/ja970279s
. [all data]
Ingemann and Nibbering, 1985, 2
Ingemann, S.; Nibbering, N.M.M.,
Gas phase chemistry of alpha-thio carbanions,
Can. J. Chem., 1985, 62, 2273. [all data]
Grabowski, Roy, et al., 1988
Grabowski, J.J.; Roy, P.D.; Leone, R.,
Trimethylphosphine: Anion-Molecule Reactions and Acidity in the Gas Phase,
J. Chem. Soc. Perkin Trans., 1988, 2, 8, 1627, https://doi.org/10.1039/p29880001627
. [all data]
Hunter and Lias, 1998
Hunter, E.P.; Lias, S.G.,
Evaluated Gas Phase Basicities and Proton Affinities of Molecules: An Update,
J. Phys. Chem. Ref. Data, 1998, 27, 3, 413-656, https://doi.org/10.1063/1.556018
. [all data]
Bancroft, Chan, et al., 1982
Bancroft, G.M.; Chan, T.; Puddephatt, R.J.; Tse, J.S.,
Role of the Au 5d orbitals in bonding: Photoelectron spectra of [AuMe(PMe3)],
Inorg. Chem., 1982, 21, 2946. [all data]
Hodges, McDonnell, et al., 1980
Hodges, R.V.; McDonnell, T.J.; Beauchamp, J.L.,
Properties reactions of trimethyl phosphite, trimethyl phosphate, triethyl phosphate, and trimethyl phosphorothionate by ion cyclotron resonance spectroscopy,
J. Am. Chem. Soc., 1980, 102, 1327. [all data]
Hodges, Houle, et al., 1980
Hodges, R.V.; Houle, F.A.; Beauchamp, J.L.; Montag, R.A.; Verkade, J.G.,
Effects of molecular structure on basicity. Gas phase proton affinities of cyclic phosphites,
J. Am. Chem. Soc., 1980, 102, 932. [all data]
Yarbrough and Hall, 1978
Yarbrough, L.W., II; Hall, M.B.,
Photoelectron spectra of substituted chromium, molybdenum, and tungsten pentacarbonyls. Relative π-acceptor and σ-donor properties of various phosphorus ligands,
Inorg. Chem., 1978, 17, 2269. [all data]
Staley and Beauchamp, 1974
Staley, R.H.; Beauchamp, J.L.,
Basicities ion-molecule reactions of the methylphosphines in the gas phase by ion cyclotron resonance spectroscopy,
J. Am. Chem. Soc., 1974, 96, 6252. [all data]
Wada and Kiser, 1964
Wada, Y.; Kiser, R.W.,
A mass spectrometric study of some alkyl-substituted phosphines,
J. Phys. Chem., 1964, 68, 2290. [all data]
Fischler and Halmann, 1964
Fischler, J.; Halmann, M.,
Electron-impact studies of phosphorus compounds,
J. Chem. Soc., 1964, 31. [all data]
Ikuta, Kebarle, et al., 1982
Ikuta, S.; Kebarle, P.; Bancroft, G.M.; Chan, T.; Puddephatt, R.J.,
Basicities of methyl-, methylphenyl-, and phenylphosphines in the gas phase,
J. Am. Chem. Soc., 1982, 104, 5899. [all data]
Elbel, Dieck, et al., 1982
Elbel, S.; Dieck, H.T.; Demuth, R.,
Photoelectron sSpectra of group V compounds. IX. The relative perfluoroalkyl substituent effect,
J. Fluorine Chem., 1982, 19, 349. [all data]
Cowley, Kemp, et al., 1982
Cowley, A.H.; Kemp, R.A.; Lattman, M.; McKee, M.L.,
Lewis base behavior of methylated and fluorinated phosphines. A photoelectron spectroscopic investigation,
Inorg. Chem., 1982, 21, 85. [all data]
Starzewski, Richter, et al., 1976
Starzewski, K.-H.A.O.; Richter, W.; Schmidbaur, H.,
Photoelektronenspektren und Struktur von Arsenyliden. P versus As: Ein Beitrag zur Problematik der ylidischen Bindung,
Chem. Ber., 1976, 109, 473. [all data]
Starzewski and Bock, 1976
Starzewski, K.A.O.; Bock, H.,
Photoelectron spectra and molecular properties. 58.1,2 Phosphorus ylides: Gas phase ionization potentials and charge distribution,
J. Am. Chem. Soc., 1976, 98, 8486. [all data]
Lappert, Pedley, et al., 1975
Lappert, M.F.; Pedley, J.B.; Wilkins, B.T.; Stelzer, O.; Unger, E.,
Bonding studies of compounds of boron and the group 3-5 elements. Part XIII. He(I) photoelectron spectra of phosphines RnPX3-n (R=Me or Bu'; X=H, Cl, or F; n=1-3), (Me2N)nPCl3-n(n=1-3), and (R2N)PF2(R=Me or Et),
J. Chem. Soc. Dalton Trans., 1975, 1207. [all data]
Elbel, Bergmann, et al., 1974
Elbel, S.; Bergmann, H.; EnBlin, W.,
Photoelectron spectra of the trimethyl compounds of the Group V elements,
J. Chem. Soc. Faraday Trans. 2., 1974, 70, 555. [all data]
Schafer and Schweig, 1972
Schafer, W.; Schweig, A.,
Zur Konjugation in aromatischen Aminen und Phosphanen,
Angew. Chem., 1972, 84, 898. [all data]
Cradock, Ebsworth, et al., 1972
Cradock, S.; Ebsworth, E.A.V.; Savage, W.J.; Whiteford, R.A.,
Photoelectron spectra of some methyl, silyl and germyl amines, phosphines and arsines,
J. Chem. Soc. Faraday Trans. 2, 1972, 68, 934. [all data]
Taft, Martin, et al., 1965
Taft, R.W.; Martin, R.H.; Lampe, F.W.,
Stabilization energies of substituted methyl cations. The effect of strong demand on the resonance order,
J. Am. Chem. Soc., 1965, 87, 2490. [all data]
Halmann, 1963
Halmann, M.,
J. Chem. Soc., 1963, 2853. [all data]