1-Bromo-1-chloroethane
- Formula: C2H4BrCl
- Molecular weight: 143.410
- IUPAC Standard InChIKey: QMSVNDSDEZTYAS-UHFFFAOYSA-N
- CAS Registry Number: 593-96-4
- Chemical structure:
View 3d structure (requires JavaScript / HTML 5) - Other names: CH3CHClBr; Ethane, 1-bromo-1-chloro-

Gas phase thermochemistry data

Data compiled by: Hussein Y. Afeefy, Joel F. Liebman, and Stephen E. Stein
Quantity | Value | Units | Method | Reference | Comment |
---|---|---|---|---|---|
ΔfH°gas | -81. ± 3. | kJ/mol | Eqk | Busheva, Levanova, et al., 1980 | Dehydrohalogenation |

Phase change data

Data compiled as indicated in comments:
BS - Robert L. Brown and Stephen E. Stein
AC - William E. Acree, Jr., James S. Chickos
Quantity | Value | Units | Method | Reference | Comment |
---|---|---|---|---|---|
Tboil | 356.2 | K | N/A | Weast and Grasselli, 1989 | BS |
Reduced pressure boiling point
Tboil (K) | Pressure (bar) | Reference | Comment |
---|---|---|---|
353.6 to 354.6 | 0.980 | Buckingham and Donaghy, 1982 | BS |
Enthalpy of vaporization
ΔvapH (kJ/mol) | Temperature (K) | Method | Reference | Comment |
---|---|---|---|---|
33.1 | 305. | A | Stephenson and Malanowski, 1987 | Based on data from 290. to 356. K.; AC |
46.7 | 252. | N/A | Stull, 1947 | Based on data from 237. to 356. K.; AC |
Antoine Equation Parameters
log10(P) = A − (B / (T + C))
P = vapor pressure (bar)
T = temperature (K)
View plot Requires a JavaScript / HTML 5 canvas capable browser.
Temperature (K) | A | B | C | Reference | Comment |
---|---|---|---|---|---|
237. to 355.8 | 3.02031 | 732.131 | -113.519 | Stull, 1947 | Coefficents calculated by NIST from author's data. |

Reaction thermochemistry data

Data compiled by: Hussein Y. Afeefy, Joel F. Liebman, and Stephen E. Stein
Individual Reactions
By formula: C2H4BrCl = HBr + C2H3Cl
Quantity | Value | Units | Method | Reference | Comment |
---|---|---|---|---|---|
ΔrH° | 83.3 ± 0.8 | kJ/mol | Eqk | Busheva, Levanova, et al., 1980 | gas phase; Dehydrohalogenation |
By formula: C2H4BrCl = C2H3Br + HCl
Quantity | Value | Units | Method | Reference | Comment |
---|---|---|---|---|---|
ΔrH° | 66. ± 2. | kJ/mol | Eqk | Busheva, Levanova, et al., 1980 | gas phase; Dehydrohalogenation |
By formula: 2C2H4BrCl = C2H4Br2 + C2H4Cl2
Quantity | Value | Units | Method | Reference | Comment |
---|---|---|---|---|---|
ΔrH° | 7.9 ± 0.4 | kJ/mol | Eqk | Busheva, Levanova, et al., 1980 | gas phase; Dehydrohalogenation |

Gas phase ion energetics data

Data compiled as indicated in comments:
LLK - Sharon G. Lias, Rhoda D. Levin, and Sherif A. Kafafi
Ionization energy determinations
IE (eV) | Method | Reference | Comment |
---|---|---|---|
10.37 | PE | Berman, Anicich, et al., 1979 | LLK |
10.42 | PI | Berman, Anicich, et al., 1979 | LLK |
Appearance energy determinations
Ion | AE (eV) | Other Products | Method | Reference | Comment |
---|---|---|---|---|---|
C2H4Br+ | 10.57 | ? | PI | Berman, Anicich, et al., 1979 | LLK |
C2H4Cl+ | 10.52 | ? | PI | Berman, Anicich, et al., 1979 | LLK |

References

Busheva, Levanova, et al., 1980
Busheva, L.I.; Levanova, S.V.; Rodova, R.M.; Rozhnov, A.M.,
Thermocatalytic reactions of 1,1-bromochloroethane,
Russ. J. Phys. Chem. (Engl. Transl.), 1980, 54, 1403-1404. [all data]
Weast and Grasselli, 1989
CRC Handbook of Data on Organic Compounds, 2nd Editon, Weast,R.C and Grasselli, J.G., ed(s)., CRC Press, Inc., Boca Raton, FL, 1989, 1. [all data]
Buckingham and Donaghy, 1982
Buckingham, J.; Donaghy, S.M.,
Dictionary of Organic Compounds: Fifth Edition, Chapman and Hall, New York, 1982, 1. [all data]
Stephenson and Malanowski, 1987
Stephenson, Richard M.; Malanowski, Stanislaw,
Handbook of the Thermodynamics of Organic Compounds, 1987, https://doi.org/10.1007/978-94-009-3173-2
. [all data]
Stull, 1947
Stull, Daniel R.,
Vapor Pressure of Pure Substances. Organic and Inorganic Compounds,
Ind. Eng. Chem., 1947, 39, 4, 517-540, https://doi.org/10.1021/ie50448a022
. [all data]
Berman, Anicich, et al., 1979
Berman, D.W.; Anicich, V.; Beauchamp, J.L.,
Stabilities of isomeric halonium ions C2H4X+ (X = Cl, Br) by photoionization mass spectrometry iand on cyclotron resonance spectroscopy. General considerations of the relative stabilities of cyclic and acyclic isomeric onium ions,
J. Am. Chem. Soc., 1979, 101, 1239. [all data]