Carbonic dibromide
- Formula: CBr2O
- Molecular weight: 187.818
- IUPAC Standard InChIKey: MOIPGXQKZSZOQX-UHFFFAOYSA-N
- CAS Registry Number: 593-95-3
- Chemical structure:
View 3d structure (requires JavaScript / HTML 5) - Permanent link for this species. Use this link for bookmarking this species for future reference.

Gas phase thermochemistry data

Data compiled by: Hussein Y. Afeefy, Joel F. Liebman, and Stephen E. Stein
Quantity | Value | Units | Method | Reference | Comment |
---|---|---|---|---|---|
ΔfH°gas | -113.5 ± 0.50 | kJ/mol | Eqk | Dunning and Pritchard, 1972 |

Condensed phase thermochemistry data

Data compiled by: Hussein Y. Afeefy, Joel F. Liebman, and Stephen E. Stein
Quantity | Value | Units | Method | Reference | Comment |
---|---|---|---|---|---|
ΔfH°liquid | -145. ± 0.8 | kJ/mol | Cm | Anthoney, Finch, et al., 1970 | Heat of hydrolysis |

Phase change data

Data compiled by: Hussein Y. Afeefy, Joel F. Liebman, and Stephen E. Stein
Quantity | Value | Units | Method | Reference | Comment |
---|---|---|---|---|---|
ΔvapH° | 31.0 ± 1.3 | kJ/mol | V | Anthoney, Finch, et al., 1970 | Heat of hydrolysis |

Reaction thermochemistry data

Data compiled by: Hussein Y. Afeefy, Joel F. Liebman, and Stephen E. Stein
Individual Reactions
Quantity | Value | Units | Method | Reference | Comment |
---|---|---|---|---|---|
ΔrH° | 33.9 ± 0.42 | kJ/mol | Eqk | Dunning and Pritchard, 1972 | gas phase |
ΔrH° | 4.3 ± 0.4 | kJ/mol | Eqk | Schumacher and Bergmann, 1931 | gas phase |
By formula: CBr2O + H2O = 2HBr + CO2
Quantity | Value | Units | Method | Reference | Comment |
---|---|---|---|---|---|
ΔrH° | -205.3 ± 0.67 | kJ/mol | Cm | Anthoney, Finch, et al., 1970 | liquid phase; Heat of hydrolysis |

Gas phase ion energetics data

Data compiled as indicated in comments:
LLK - Sharon G. Lias, Rhoda D. Levin, and Sherif A. Kafafi
Ionization energy determinations
IE (eV) | Method | Reference | Comment |
---|---|---|---|
10.8 | PE | Thomas and Thompson, 1972 | LLK |
11.0 | PE | Thomas and Thompson, 1972 | Vertical value; LLK |

Vibrational and/or electronic energy levels

Data compiled by: Takehiko Shimanouchi
Symmetry: C2ν Symmetry Number σ = 2
Sym. | No | Approximate | Selected Freq. | Infrared | Raman | Comments | ||||
---|---|---|---|---|---|---|---|---|---|---|
Species | type of mode | Value | Rating | Value | Phase | Value | Phase | |||
a1 | 1 | CO str | 1828 | B | 1828 VS | gas | ||||
a1 | 2 | CBr2 s-str | 425 | C | 425 M | gas | 429 S | liq. | ||
a1 | 3 | CBr2 deform | 181 | D | 181 S | liq. | ||||
b1 | 4 | CBr2 a-str | 757 | C | 787 VS | gas | ||||
b1 | 4 | CBr2 a-str | 757 | C | 747 VS | gas | FR(ν2+ν5) | |||
b1 | 5 | CO deform | 350 | C | 350 VW | gas | 350 M b | liq. | ||
b2 | 6 | Op-deform | 512 | B | 512 M | gas | ||||
Source: Shimanouchi, 1972

References

Dunning and Pritchard, 1972
Dunning, B.K.; Pritchard, H.O.,
The enthalpy of formation of bromophosgene,
J. Chem. Thermodyn., 1972, 4, 213-218. [all data]
Anthoney, Finch, et al., 1970
Anthoney, M.E.; Finch, A.; Gardner, P.J.,
The enthalpy of hydrolysis and thermodynamic properties of carbonyl bromide,
J. Chem. Thermodyn., 1970, 2, 697-700. [all data]
Schumacher and Bergmann, 1931
Schumacher, H.-J.; Bergmann, P.,
Die kinetik und photochemie des bromphosgens,
Z. Phys. Chem., 1931, 13, 269-284. [all data]
Thomas and Thompson, 1972
Thomas, R.K.; Thompson, H.,
Photoelectron spectra of carbonyl halides and related compounds,
Proc. R. Soc. London A:, 1972, 327, 13. [all data]
Shimanouchi, 1972
Shimanouchi, T.,
Tables of Molecular Vibrational Frequencies Consolidated Volume II,
J. Phys. Chem. Ref. Data, 1972, 6, 3, 993-1102. [all data]