trimethylarsine
- Formula: C3H9As
- Molecular weight: 120.0252
- IUPAC Standard InChIKey: HTDIUWINAKAPER-UHFFFAOYSA-N
- CAS Registry Number: 593-88-4
- Chemical structure:
View 3d structure (requires JavaScript / HTML 5) - Other names: Arsine, trimethyl-

Condensed phase thermochemistry data

Data compiled by: Eugene S. Domalski and Elizabeth D. Hearing
Quantity | Value | Units | Method | Reference | Comment |
---|---|---|---|---|---|
S°liquid | 251.3 | J/mol*K | N/A | Nistratov, Sheiman, et al., 1988 |
Constant pressure heat capacity of liquid
Cp,liquid (J/mol*K) | Temperature (K) | Reference | Comment |
---|---|---|---|
154.0 | 298.15 | Nistratov, Sheiman, et al., 1988 | T = 13 to 310 K. |

Phase change data

Data compiled as indicated in comments:
TRC - Thermodynamics Research Center, NIST Boulder Laboratories, Chris Muzny director
AC - William E. Acree, Jr., James S. Chickos
DH - Eugene S. Domalski and Elizabeth D. Hearing
Quantity | Value | Units | Method | Reference | Comment |
---|---|---|---|---|---|
Ttriple | 186.60 | K | N/A | Nistratov, Sheiman, et al., 1988, 2 | Uncertainty assigned by TRC = 0.02 K; TRC |
Enthalpy of vaporization
ΔvapH (kJ/mol) | Temperature (K) | Reference | Comment |
---|---|---|---|
27.7 ± 0.2 | 260. | Baev, 2001 | Based on data from 240. to 280. K.; AC |
Enthalpy of fusion
ΔfusH (kJ/mol) | Temperature (K) | Reference | Comment |
---|---|---|---|
8.962 | 186.60 | Nistratov, Sheiman, et al., 1988 | DH |
8.96 | 186.6 | Nistratov, Sheiman, et al., 1988, 2 | AC |
Entropy of fusion
ΔfusS (J/mol*K) | Temperature (K) | Reference | Comment |
---|---|---|---|
48.03 | 186.60 | Nistratov, Sheiman, et al., 1988 | DH |

Gas phase ion energetics data

Data evaluated as indicated in comments:
HL - Edward P. Hunter and Sharon G. Lias
Data compiled as indicated in comments:
LBLHLM - Sharon G. Lias, John E. Bartmess, Joel F. Liebman, John L. Holmes, Rhoda D. Levin, and W. Gary Mallard
RDSH - Henry M. Rosenstock, Keith Draxl, Bruce W. Steiner, and John T. Herron
Quantity | Value | Units | Method | Reference | Comment |
---|---|---|---|---|---|
Proton affinity (review) | 897.3 | kJ/mol | N/A | Hunter and Lias, 1998 | HL |
Quantity | Value | Units | Method | Reference | Comment |
Gas basicity | 864.9 | kJ/mol | N/A | Hunter and Lias, 1998 | HL |
Ionization energy determinations
IE (eV) | Method | Reference | Comment |
---|---|---|---|
8.2 | PE | Elbel, Dieck, et al., 1982 | LBLHLM |
8.3 ± 0.1 | EI | Cullen and Frost, 1962 | RDSH |
8.65 | PE | Elbel, Dieck, et al., 1982 | Vertical value; LBLHLM |

References

Nistratov, Sheiman, et al., 1988
Nistratov, V.P.; Sheiman, M.S.; Rabinovich, I.B.; Vasil'ev, V.G.; Karataev, E.N.; Feshchenko, I.A.,
Heat capacity and thermodynamic functions of trimethylarsine,
Zhur. Fiz. Khim., 1988, 62(8), 2219-2221. [all data]
Nistratov, Sheiman, et al., 1988, 2
Nistratov, V.P.; Sheiman, M.S.; Rabinovich, I.B.; Vasil'ev, V.G.; Karataev, E.N.; Feshchenko, I.A.,
Zh. Fiz. Khim., 1988, 62, 2219. [all data]
Baev, 2001
Baev, A.K.,
Izv. Vyssh. Uchebn. Zaved., Khim. Khim. Tekhnol., 2001, 44, 1, 3. [all data]
Hunter and Lias, 1998
Hunter, E.P.; Lias, S.G.,
Evaluated Gas Phase Basicities and Proton Affinities of Molecules: An Update,
J. Phys. Chem. Ref. Data, 1998, 27, 3, 413-656, https://doi.org/10.1063/1.556018
. [all data]
Elbel, Dieck, et al., 1982
Elbel, S.; Dieck, H.T.; Demuth, R.,
Photoelectron sSpectra of group V compounds. IX. The relative perfluoroalkyl substituent effect,
J. Fluorine Chem., 1982, 19, 349. [all data]
Cullen and Frost, 1962
Cullen, W.R.; Frost, D.C.,
Ionization potentials of some perfluoroalkyl arsines,
Can. J. Chem., 1962, 40, 390. [all data]