dimethyl telluride
- Formula: C2H6Te
- Molecular weight: 157.67
- IUPAC Standard InChIKey: YMUZFVVKDBZHGP-UHFFFAOYSA-N
- CAS Registry Number: 593-80-6
- Chemical structure:
View 3d structure (requires JavaScript / HTML 5) - Permanent link for this species. Use this link for bookmarking this species for future reference.

Phase change data

Data compiled by: William E. Acree, Jr., James S. Chickos
Quantity | Value | Units | Method | Reference | Comment |
---|---|---|---|---|---|
ΔvapH° | 36.1 ± 1.0 | kJ/mol | BG | van der Vis, Cordfunke, et al., 1996 | Based on data from 267. to 369. K. |
ΔvapH° | 37.4 ± 0.7 | kJ/mol | C | Voronkov, Klyuchnikov, et al., 1989 |
Enthalpy of vaporization
ΔvapH (kJ/mol) | Temperature (K) | Method | Reference | Comment |
---|---|---|---|---|
34.4 | 313. | N/A | Dykyj, Svoboda, et al., 1999 | Based on data from 298. to 367. K. |
35.6 ± 0.1 | 323. | N/A | Baev, 1997 | Based on data from 273. to 372. K. See also Baev, Podkovirov, et al., 1996. |
36.9 | 282. | BG | van der Vis, Cordfunke, et al., 1996 | Based on data from 267. to 369. K. |
Enthalpy of fusion
ΔfusH (kJ/mol) | Temperature (K) | Reference |
---|---|---|
7.77 | 201.9 | Sheiman, Nistratov, et al., 1998 |

Gas phase ion energetics data

Data compiled as indicated in comments:
LBLHLM - Sharon G. Lias, John E. Bartmess, Joel F. Liebman, John L. Holmes, Rhoda D. Levin, and W. Gary Mallard
LLK - Sharon G. Lias, Rhoda D. Levin, and Sherif A. Kafafi
Ionization energy determinations
IE (eV) | Method | Reference | Comment |
---|---|---|---|
7.85 | PE | Chang, Young, et al., 1986 | LBLHLM |
7.926 ± 0.010 | S | Scott, Causley, et al., 1973 | LLK |
7.89 | PE | Cradock and Whiteford, 1972 | Vertical value; LLK |

References

van der Vis, Cordfunke, et al., 1996
van der Vis, Martin G.M.; Cordfunke, Erik H.P.; Konings, Rudy J.M.; Oskam, Ad,
Vibrational frequencies, vapour pressure and an assessment of the thermodynamic properties of dimethyl telluride,
Faraday Trans., 1996, 92, 6, 973, https://doi.org/10.1039/ft9969200973
. [all data]
Voronkov, Klyuchnikov, et al., 1989
Voronkov, M.G.; Klyuchnikov, V.A.; Kolabin, S.N.; Shvets, G.N.; Varushin, P.I.; Deryagina, E.N.; Korchevin, N.A.; Tsvetnitskaya, S.I.,
Thermochemical properties of dialkyl chalcogenides and dichalcogenides RMnR (M = sulfur, selenium, tellurium; n = 1, 2),
Dokl. Akad. Nauk SSSR, Phys. Chem., 1989, 307, 5, 1139. [all data]
Dykyj, Svoboda, et al., 1999
Dykyj, J.; Svoboda, J.; Wilhoit, R.C.; Frenkel, M.L.; Hall, K.R.,
Vapor Pressure of Chemicals: Part A. Vapor Pressure and Antoine Constants for Hydrocarbons and Sulfur, Selenium, Tellurium and Hydrogen Containing Organic Compounds, Springer, Berlin, 1999, 373. [all data]
Baev, 1997
Baev, A.K.,
Thermodynamic study of structural changes in solutions of dimethyl-zinc with methyl compounds of Group VIB elements,
Zh. Neorg. Khim., 1997, 42, 4, 662. [all data]
Baev, Podkovirov, et al., 1996
Baev, A.K.; Podkovirov, A.I.; Kosirkin, V.I.,
Thermodynamic properties and associative interactions of alkyl compounds of tellurium,
Izv. Vyssh. Uchebn. Zaved., Khim. Khim. Tekhnol., 1996, 39, 6, 10. [all data]
Sheiman, Nistratov, et al., 1998
Sheiman, M.S.; Nistratov, V.P.; Kamelova, G.P.,
Heat capacity and the thermodynamic functions of dimethyltellurium,
Zh. Fiz. Khim., 1998, 72, 10, 1789. [all data]
Chang, Young, et al., 1986
Chang, F.C.; Young, V.Y.; Prather, J.W.; Cheng, K.L.,
Study of methyl chalcogen compounds with ultraviolet photoelectron spectroscopy,
J. Electron Spectrosc. Relat. Phenom., 1986, 40, 363. [all data]
Scott, Causley, et al., 1973
Scott, J.D.; Causley, G.C.; Russell, B.R.,
Vacuum ultraviolet absorption spectra of dimethylsulfide, dimethylselenide, and dimethyltelluride,
J. Chem. Phys., 1973, 59, 6577. [all data]
Cradock and Whiteford, 1972
Cradock, S.; Whiteford, R.A.,
Photoelectron spectra of the methyl, silyl and germyl derivatives of the group VI elements,
J. Chem. Soc. Faraday Trans. 2, 1972, 68, 281. [all data]