Hydroxylamine, N-methyl-
- Formula: CH5NO
- Molecular weight: 47.0565
- IUPAC Standard InChIKey: CPQCSJYYDADLCZ-UHFFFAOYSA-N
- CAS Registry Number: 593-77-1
- Chemical structure:
View 3d structure (requires JavaScript / HTML 5) - Permanent link for this species. Use this link for bookmarking this species for future reference.

Phase change data

Data compiled by: William E. Acree, Jr., James S. Chickos
Enthalpy of vaporization
ΔvapH (kJ/mol) | Temperature (K) | Method | Reference | Comment |
---|---|---|---|---|
49.7 | 308. | A | Stephenson and Malanowski, 1987 | Based on data from 293. to 338. K. See also Dykyj, 1970. |
49.3 | 325. | A | Stephenson and Malanowski, 1987 | Based on data from 313. to 338. K. See also Bissot, Parry, et al., 1957 and Boublik, Fried, et al., 1984. |
Enthalpy of sublimation
ΔsubH (kJ/mol) | Temperature (K) | Reference | Comment |
---|---|---|---|
56.6 | 288. | Stephenson and Malanowski, 1987 | Based on data from 273. to 308. K. See also Bissot, Parry, et al., 1957. |

Gas phase ion energetics data

Data compiled as indicated in comments:
LLK - Sharon G. Lias, Rhoda D. Levin, and Sherif A. Kafafi
Ionization energy determinations
IE (eV) | Method | Reference | Comment |
---|---|---|---|
9.0 | PE | Rademacher and Freckmann, 1980 | LLK |
9.82 | PE | Rademacher and Freckmann, 1980 | Vertical value; LLK |

References

Stephenson and Malanowski, 1987
Stephenson, Richard M.; Malanowski, Stanislaw,
Handbook of the Thermodynamics of Organic Compounds, 1987, https://doi.org/10.1007/978-94-009-3173-2
. [all data]
Dykyj, 1970
Dykyj, J.,
Petrochemica, 1970, 10, 2, 51. [all data]
Bissot, Parry, et al., 1957
Bissot, T.C.; Parry, R.W.; Campbell, D.H.,
The Physical and Chemical Properties of the Methylhydroxylamines 1,
J. Am. Chem. Soc., 1957, 79, 4, 796-800, https://doi.org/10.1021/ja01561a005
. [all data]
Boublik, Fried, et al., 1984
Boublik, T.; Fried, V.; Hala, E.,
The Vapour Pressures of Pure Substances: Selected Values of the Temperature Dependence of the Vapour Pressures of Some Pure Substances in the Normal and Low Pressure Region, 2nd ed., Elsevier, New York, 1984, 972. [all data]
Rademacher and Freckmann, 1980
Rademacher, P.; Freckmann, B.,
Photoelektronen spektren und Konformations-verhalten von Hydroxylamin und Methylhydroxylaminen,
J. Electron Spectrosc. Relat. Phenom., 1980, 19, 251. [all data]